RESNUM,RESNAME,H_X,H_Y,H_BEST_REF_SCORE,H_BEST_REF_COV,H_BEST_REF_MATCH,H_UCBShift,HA_X,HA_Y,HA_BEST_REF_SCORE,HA_BEST_REF_COV,HA_BEST_REF_MATCH,HA_UCBShift,C_X,C_Y,C_BEST_REF_SCORE,C_BEST_REF_COV,C_BEST_REF_MATCH,C_UCBShift,CA_X,CA_Y,CA_BEST_REF_SCORE,CA_BEST_REF_COV,CA_BEST_REF_MATCH,CA_UCBShift,CB_X,CB_Y,CB_BEST_REF_SCORE,CB_BEST_REF_COV,CB_BEST_REF_MATCH,CB_UCBShift,N_X,N_Y,N_BEST_REF_SCORE,N_BEST_REF_COV,N_BEST_REF_MATCH,N_UCBShift
1,GLU,8.51851696917527,,0,0,0,8.51851696917527,4.368360689979465,,0,0,0,4.368360689979465,175.92924331705515,,0,0,0,175.92924331705515,56.20383001904207,,0,0,0,56.20383001904207,30.180405742302142,,0,0,0,30.180405742302142,122.09230582256632,,0,0,0,122.09230582256632
2,LEU,8.313471870690421,,0,0,0,8.313471870690421,4.394322879362305,,0,0,0,4.394322879362305,177.36762084042624,,0,0,0,177.36762084042624,54.73060871816517,,0,0,0,54.73060871816517,42.42491116342546,,0,0,0,42.42491116342546,123.63785026298146,,0,0,0,123.63785026298146
3,SER,8.838461253718505,,0,0,0,8.838461253718505,4.470705462925963,,0,0,0,4.470705462925963,174.60622108797867,,0,0,0,174.60622108797867,58.61538271434676,,0,0,0,58.61538271434676,63.88760612742813,,0,0,0,63.88760612742813,118.61028975475635,,0,0,0,118.61028975475635
4,ASN,8.853961846020646,,0,0,0,8.853961846020646,4.567388211793762,,0,0,0,4.567388211793762,175.76624718196248,,0,0,0,175.76624718196248,54.70960529225774,,0,0,0,54.70960529225774,38.59432510104895,,0,0,0,38.59432510104895,120.59113268005328,,0,0,0,120.59113268005328
5,THR,8.016971672455323,,0,0,0,8.016971672455323,4.621029061249861,,0,0,0,4.621029061249861,174.34052148227326,,0,0,0,174.34052148227326,62.09371303845044,,0,0,0,62.09371303845044,70.22791115080474,,0,0,0,70.22791115080474,107.17829037168941,,0,0,0,107.17829037168941
6,ARG,7.620879302242203,,0,0,0,7.620879302242203,5.156635708757909,,0,0,0,5.156635708757909,175.4585329619991,,0,0,0,175.4585329619991,55.919311634953935,,0,0,0,55.919311634953935,31.915985963186813,,0,0,0,31.915985963186813,122.262215798668,,0,0,0,122.262215798668
7,LEU,9.379664932678434,,0,0,0,9.379664932678434,5.253936153513154,,0,0,0,5.253936153513154,175.69370048779552,,0,0,0,175.69370048779552,53.04758182196692,,0,0,0,53.04758182196692,44.774001819491616,,0,0,0,44.774001819491616,124.34122476877566,,0,0,0,124.34122476877566
8,PHE,9.325094784315684,,0,0,0,9.325094784315684,5.302735298207349,,0,0,0,5.302735298207349,173.87644448094684,,0,0,0,173.87644448094684,56.00567495754246,,0,0,0,56.00567495754246,42.34487362706738,,0,0,0,42.34487362706738,123.19673743558663,,0,0,0,123.19673743558663
9,VAL,8.733716126240425,,0,0,0,8.733716126240425,4.7751888750527245,,0,0,0,4.7751888750527245,174.19992086321457,,0,0,0,174.19992086321457,60.48231406786547,,0,0,0,60.48231406786547,33.938741691641695,,0,0,0,33.938741691641695,127.11702880613831,,0,0,0,127.11702880613831
10,ARG,8.600423642157843,,0,0,0,8.600423642157843,4.84620653902209,,0,0,0,4.84620653902209,173.25324825414586,,0,0,0,173.25324825414586,53.01376943761794,,0,0,0,53.01376943761794,32.1624287987124,,0,0,0,32.1624287987124,124.6156387993229,,0,0,0,124.6156387993229
11,PRO,,,0,0,0,,4.570351424925075,,0,0,0,4.570351424925075,175.88980886732713,,0,0,0,175.88980886732713,62.61370900934066,,0,0,0,62.61370900934066,32.36620869003219,,0,0,0,32.36620869003219,,,0,0,0,
12,PHE,8.466369968326118,,0,0,0,8.466369968326118,5.051313582084583,,0,0,0,5.051313582084583,174.15389074868466,,0,0,0,174.15389074868466,54.821521700721505,,0,0,0,54.821521700721505,40.119363846753245,,0,0,0,40.119363846753245,120.44975566082252,,0,0,0,120.44975566082252
13,PRO,,,0,0,0,,4.536782088483738,,0,0,0,4.536782088483738,177.79813175097127,,0,0,0,177.79813175097127,62.418997486075035,,0,0,0,62.418997486075035,32.37524526576202,,0,0,0,32.37524526576202,,,0,0,0,
14,LEU,8.500843542069042,,0,0,0,8.500843542069042,4.058849184204684,,0,0,0,4.058849184204684,177.40568076584526,,0,0,0,177.40568076584526,56.85034108565878,,0,0,0,56.85034108565878,41.552484717166166,,0,0,0,41.552484717166166,122.09675328246753,,0,0,0,122.09675328246753
15,ASP,8.2849052502775,,0,0,0,8.2849052502775,4.592964997890998,,0,0,0,4.592964997890998,176.33607147690088,,0,0,0,176.33607147690088,54.20711361894772,,0,0,0,54.20711361894772,40.45083997662338,,0,0,0,40.45083997662338,117.69246468013098,,0,0,0,117.69246468013098
16,VAL,7.552583695909646,,0,0,0,7.552583695909646,4.059611407786657,,0,0,0,4.059611407786657,175.443218651665,,0,0,0,175.443218651665,62.921542341053396,,0,0,0,62.921542341053396,32.05053760333,,0,0,0,32.05053760333,119.66944481417471,,0,0,0,119.66944481417471
17,GLN,8.79411223850039,,0,0,0,8.79411223850039,4.4901893511100015,,0,0,0,4.4901893511100015,176.8461111405206,,0,0,0,176.8461111405206,53.83861728771784,,0,0,0,53.83861728771784,31.38458423250638,,0,0,0,31.38458423250638,124.3329665982684,,0,0,0,124.3329665982684
18,GLU,8.984496939227439,,0,0,0,8.984496939227439,3.8426064071983563,,0,0,0,3.8426064071983563,177.73984973293372,,0,0,0,177.73984973293372,59.949218585769785,,0,0,0,59.949218585769785,29.541385623476522,,0,0,0,29.541385623476522,123.92393801645576,,0,0,0,123.92393801645576
19,SER,8.436137151515151,,0,0,0,8.436137151515151,4.236202027350427,,0,0,0,4.236202027350427,176.90456657145631,,0,0,0,176.90456657145631,61.55602688368853,,0,0,0,61.55602688368853,62.501957848451546,,0,0,0,62.501957848451546,113.82518782085137,,0,0,0,113.82518782085137
20,GLU,7.8006243919025415,,0,0,0,7.8006243919025415,4.145743910531135,,0,0,0,4.145743910531135,178.79731707297148,,0,0,0,178.79731707297148,58.9607230958042,,0,0,0,58.9607230958042,30.41125717020757,,0,0,0,30.41125717020757,123.16591914181929,,0,0,0,123.16591914181929
21,LEU,8.065421905494505,,0,0,0,8.065421905494505,4.190507071903097,,0,0,0,4.190507071903097,179.1239713097014,,0,0,0,179.1239713097014,58.00690931263736,,0,0,0,58.00690931263736,41.3526077029082,,0,0,0,41.3526077029082,120.64262947562992,,0,0,0,120.64262947562992
22,ASN,8.82375007078477,,0,0,0,8.82375007078477,4.488508997108448,,0,0,0,4.488508997108448,177.81866943253968,,0,0,0,177.81866943253968,57.02989482982018,,0,0,0,57.02989482982018,38.64225526396936,,0,0,0,38.64225526396936,119.54055298211233,,0,0,0,119.54055298211233
23,GLU,8.106983302780552,,0,0,0,8.106983302780552,4.087639607095682,,0,0,0,4.087639607095682,178.93250191705516,,0,0,0,178.93250191705516,59.01661578450994,,0,0,0,59.01661578450994,29.697157158319456,,0,0,0,29.697157158319456,120.91891197072373,,0,0,0,120.91891197072373
24,ILE,8.103390642601843,,0,0,0,8.103390642601843,3.7284990698523703,,0,0,0,3.7284990698523703,177.62727870861917,,0,0,0,177.62727870861917,64.23377529051504,,0,0,0,64.23377529051504,38.474758196142744,,0,0,0,38.474758196142744,119.22188487405928,,0,0,0,119.22188487405928
25,PHE,8.847865583882784,,0,0,0,8.847865583882784,4.6616622641691645,,0,0,0,4.6616622641691645,177.30595067071818,,0,0,0,177.30595067071818,58.86954246826507,,0,0,0,58.86954246826507,39.5186971050172,,0,0,0,39.5186971050172,115.87942661380286,,0,0,0,115.87942661380286
26,GLY,8.31778973984349,,0,0,0,8.31778973984349,3.9411599851731602,,0,0,0,3.9411599851731602,175.0649241264846,,0,0,0,175.0649241264846,49.648222849866805,,0,0,0,49.648222849866805,,,0,0,0,,109.53849632170606,,0,0,0,109.53849632170606
27,PRO,,,0,0,0,,4.3620378023088024,,0,0,0,4.3620378023088024,177.50288507751694,,0,0,0,177.50288507751694,64.54698646466866,,0,0,0,64.54698646466866,30.956279341380842,,0,0,0,30.956279341380842,,,0,0,0,
28,PHE,7.837762642857143,,0,0,0,7.837762642857143,4.542093076812077,,0,0,0,4.542093076812077,175.94707321759353,,0,0,0,175.94707321759353,58.5827062948163,,0,0,0,58.5827062948163,39.48873487765568,,0,0,0,39.48873487765568,116.16579167498057,,0,0,0,116.16579167498057
29,GLY,7.459408232256633,,0,0,0,7.459408232256633,4.220901151900877,,0,0,0,4.220901151900877,171.45058751483515,,0,0,0,171.45058751483515,44.61219491730492,,0,0,0,44.61219491730492,,,0,0,0,,105.64054398180707,,0,0,0,105.64054398180707
30,PRO,,,0,0,0,,4.469799178404928,,0,0,0,4.469799178404928,175.90529467842714,,0,0,0,175.90529467842714,63.167837248046396,,0,0,0,63.167837248046396,31.86262770667111,,0,0,0,31.86262770667111,,,0,0,0,
31,MET,8.653494196381395,,0,0,0,8.653494196381395,4.373160059218559,,0,0,0,4.373160059218559,175.69359277140637,,0,0,0,175.69359277140637,55.154102098668,,0,0,0,55.154102098668,32.79256240740926,,0,0,0,32.79256240740926,123.91727363287268,,0,0,0,123.91727363287268
32,LYS,8.79233113117438,,0,0,0,8.79233113117438,4.325811542302143,,0,0,0,4.325811542302143,176.68262673049173,,0,0,0,176.68262673049173,57.20757561734377,,0,0,0,57.20757561734377,33.73785520100456,,0,0,0,33.73785520100456,125.37459378589189,,0,0,0,125.37459378589189
33,GLU,7.890034743195693,,0,0,0,7.890034743195693,4.454498787273837,,0,0,0,4.454498787273837,173.99013503947162,,0,0,0,173.99013503947162,55.898258557364855,,0,0,0,55.898258557364855,32.99410039975025,,0,0,0,32.99410039975025,116.9617612615884,,0,0,0,116.9617612615884
34,VAL,8.531690835775336,,0,0,0,8.531690835775336,4.746361474236874,,0,0,0,4.746361474236874,174.33117525248085,,0,0,0,174.33117525248085,61.26019424671995,,0,0,0,61.26019424671995,34.47183636667776,,0,0,0,34.47183636667776,124.11302017367633,,0,0,0,124.11302017367633
35,LYS,9.02933007968143,,0,0,0,9.02933007968143,4.721144980086581,,0,0,0,4.721144980086581,175.0323685081807,,0,0,0,175.0323685081807,54.942385412698414,,0,0,0,54.942385412698414,35.20812771414697,,0,0,0,35.20812771414697,126.98075039259629,,0,0,0,126.98075039259629
36,ILE,8.893665224691976,,0,0,0,8.893665224691976,4.409608584376735,,0,0,0,4.409608584376735,175.59074901151072,,0,0,0,175.59074901151072,60.97082707897103,,0,0,0,60.97082707897103,39.48488213374403,,0,0,0,39.48488213374403,125.2399558503774,,0,0,0,125.2399558503774
37,LEU,9.015124775530026,,0,0,0,9.015124775530026,4.6229881745920745,,0,0,0,4.6229881745920745,176.50886229691974,,0,0,0,176.50886229691974,53.377227831912535,,0,0,0,53.377227831912535,44.36857552365967,,0,0,0,44.36857552365967,127.37325479396715,,0,0,0,127.37325479396715
38,ASN,8.742381439088689,,0,0,0,8.742381439088689,4.431826088494839,,0,0,0,4.431826088494839,175.6619258646298,,0,0,0,175.6619258646298,54.53131823730714,,0,0,0,54.53131823730714,38.2022792072483,,0,0,0,38.2022792072483,120.03613609992784,,0,0,0,120.03613609992784
39,GLY,8.437842552292151,,0,0,0,8.437842552292151,4.014174318625819,,0,0,0,4.014174318625819,173.6073614539405,,0,0,0,173.6073614539405,45.36926477276612,,0,0,0,45.36926477276612,,,0,0,0,,110.69383910224775,,0,0,0,110.69383910224775
40,PHE,7.765613025391276,,0,0,0,7.765613025391276,5.32913017160617,,0,0,0,5.32913017160617,173.09814676680543,,0,0,0,173.09814676680543,56.05178208783439,,0,0,0,56.05178208783439,41.400009711910315,,0,0,0,41.400009711910315,117.11793013166833,,0,0,0,117.11793013166833
41,ALA,8.887118637351536,,0,0,0,8.887118637351536,5.276583653429904,,0,0,0,5.276583653429904,174.99488437555777,,0,0,0,174.99488437555777,50.26337745959596,,0,0,0,50.26337745959596,23.557517298129646,,0,0,0,23.557517298129646,122.04596607074592,,0,0,0,122.04596607074592
42,PHE,9.311990464690865,,0,0,0,9.311990464690865,5.710957293362193,,0,0,0,5.710957293362193,175.3702494569486,,0,0,0,175.3702494569486,56.35774210904651,,0,0,0,56.35774210904651,41.94104678737929,,0,0,0,41.94104678737929,119.86863723101898,,0,0,0,119.86863723101898
43,VAL,9.330870025957376,,0,0,0,9.330870025957376,4.380129443722944,,0,0,0,4.380129443722944,173.8717891821845,,0,0,0,173.8717891821845,61.393220985431235,,0,0,0,61.393220985431235,34.21824432394273,,0,0,0,34.21824432394273,123.20561167670664,,0,0,0,123.20561167670664
44,GLU,8.851682504301253,,0,0,0,8.851682504301253,4.873874163075813,,0,0,0,4.873874163075813,175.66702889172493,,0,0,0,175.66702889172493,54.660720803885006,,0,0,0,54.660720803885006,31.86681891894772,,0,0,0,31.86681891894772,128.13549371021202,,0,0,0,128.13549371021202
45,PHE,9.302401654789653,,0,0,0,9.302401654789653,4.910246850949051,,0,0,0,4.910246850949051,176.17637223109114,,0,0,0,176.17637223109114,58.710970421983575,,0,0,0,58.710970421983575,41.59267451017871,,0,0,0,41.59267451017871,127.41036694000444,,0,0,0,127.41036694000444
46,GLU,9.184807181657233,,0,0,0,9.184807181657233,4.140715963383839,,0,0,0,4.140715963383839,176.09163278354978,,0,0,0,176.09163278354978,59.0392905960262,,0,0,0,59.0392905960262,30.550766268487067,,0,0,0,30.550766268487067,120.90955492424243,,0,0,0,120.90955492424243
47,GLU,8.113572446248195,,0,0,0,8.113572446248195,4.637792240445665,,0,0,0,4.637792240445665,177.08947459264624,,0,0,0,177.08947459264624,54.70389310544456,,0,0,0,54.70389310544456,31.742837833028084,,0,0,0,31.742837833028084,116.48531845067156,,0,0,0,116.48531845067156
48,ALA,9.023886106687756,,0,0,0,9.023886106687756,4.334687627375403,,0,0,0,4.334687627375403,179.46111761852592,,0,0,0,179.46111761852592,55.619143855161504,,0,0,0,55.619143855161504,18.233129216855367,,0,0,0,18.233129216855367,127.70772462026306,,0,0,0,127.70772462026306
49,GLU,9.037921913303363,,0,0,0,9.037921913303363,4.074420232911533,,0,0,0,4.074420232911533,178.52374119908978,,0,0,0,178.52374119908978,59.67067852128982,,0,0,0,59.67067852128982,29.022783786607835,,0,0,0,29.022783786607835,119.00809957794984,,0,0,0,119.00809957794984
50,SER,8.096057564818516,,0,0,0,8.096057564818516,4.221817701187701,,0,0,0,4.221817701187701,175.63634972563545,,0,0,0,175.63634972563545,61.71300557380397,,0,0,0,61.71300557380397,62.62788058446553,,0,0,0,62.62788058446553,115.99308700050506,,0,0,0,115.99308700050506
51,ALA,7.8785674744644245,,0,0,0,7.8785674744644245,3.5604746950466204,,0,0,0,3.5604746950466204,179.16314667059052,,0,0,0,179.16314667059052,55.15842760674326,,0,0,0,55.15842760674326,18.261029590587192,,0,0,0,18.261029590587192,124.65319842515262,,0,0,0,124.65319842515262
52,ALA,8.159999398162949,,0,0,0,8.159999398162949,3.9322736305250308,,0,0,0,3.9322736305250308,180.25574476721613,,0,0,0,180.25574476721613,54.86457227034077,,0,0,0,54.86457227034077,18.177739062409813,,0,0,0,18.177739062409813,120.74645516850372,,0,0,0,120.74645516850372
53,LYS,8.219861206793206,,0,0,0,8.219861206793206,4.007759873049173,,0,0,0,4.007759873049173,178.53728711638917,,0,0,0,178.53728711638917,59.4687041941614,,0,0,0,59.4687041941614,32.488281411255414,,0,0,0,32.488281411255414,119.20638062393164,,0,0,0,119.20638062393164
54,ALA,7.947917712420913,,0,0,0,7.947917712420913,3.1538525761738265,,0,0,0,3.1538525761738265,178.93431787746698,,0,0,0,178.93431787746698,54.50489199313464,,0,0,0,54.50489199313464,18.570588524536575,,0,0,0,18.570588524536575,121.53228439039849,,0,0,0,121.53228439039849
55,ILE,8.132213003163503,,0,0,0,8.132213003163503,3.448156950688201,,0,0,0,3.448156950688201,178.28413485266955,,0,0,0,178.28413485266955,65.88041010219224,,0,0,0,65.88041010219224,38.07265621293151,,0,0,0,38.07265621293151,119.39377434272394,,0,0,0,119.39377434272394
56,GLU,8.148743175402375,,0,0,0,8.148743175402375,3.9142599821178807,,0,0,0,3.9142599821178807,178.45466063292818,,0,0,0,178.45466063292818,59.41940636751027,,0,0,0,59.41940636751027,29.671618678116328,,0,0,0,29.671618678116328,119.1820035980575,,0,0,0,119.1820035980575
57,GLU,8.026857015268066,,0,0,0,8.026857015268066,4.203356377347653,,0,0,0,4.203356377347653,178.30547027565768,,0,0,0,178.30547027565768,57.886726455439,,0,0,0,57.886726455439,30.379215457942056,,0,0,0,30.379215457942056,116.56860299674214,,0,0,0,116.56860299674214
58,VAL,7.755959739160839,,0,0,0,7.755959739160839,3.9015715243006985,,0,0,0,3.9015715243006985,176.3589931023421,,0,0,0,176.3589931023421,63.43755359302919,,0,0,0,63.43755359302919,32.629973643345544,,0,0,0,32.629973643345544,118.3935152070707,,0,0,0,118.3935152070707
59,HIS,8.400281912537462,,0,0,0,8.400281912537462,4.245593193534243,,0,0,0,4.245593193534243,176.40626559754133,,0,0,0,176.40626559754133,58.31055837394827,,0,0,0,58.31055837394827,29.764302599223,,0,0,0,29.764302599223,119.40864874858475,,0,0,0,119.40864874858475
60,GLY,8.926006995748695,,0,0,0,8.926006995748695,3.8398227423770677,,0,0,0,3.8398227423770677,174.5077232876013,,0,0,0,174.5077232876013,45.468238063431016,,0,0,0,45.468238063431016,,,0,0,0,,117.0690595989566,,0,0,0,117.0690595989566
61,LYS,7.8445956123598615,,0,0,0,7.8445956123598615,4.3228405686868685,,0,0,0,4.3228405686868685,176.13953067481407,,0,0,0,176.13953067481407,56.28254730492286,,0,0,0,56.28254730492286,33.21464980253636,,0,0,0,33.21464980253636,122.56168674304585,,0,0,0,122.56168674304585
62,SER,8.594794220562772,,0,0,0,8.594794220562772,4.697339442324342,,0,0,0,4.697339442324342,173.98403424175822,,0,0,0,173.98403424175822,58.3174287058941,,0,0,0,58.3174287058941,63.59328058192363,,0,0,0,63.59328058192363,121.31287067117327,,0,0,0,121.31287067117327
63,PHE,9.372885088600288,,0,0,0,9.372885088600288,4.890906791125541,,0,0,0,4.890906791125541,175.14101466108892,,0,0,0,175.14101466108892,57.62486877077922,,0,0,0,57.62486877077922,42.24723083674104,,0,0,0,42.24723083674104,127.02295657479742,,0,0,0,127.02295657479742
64,ALA,8.45333207903208,,0,0,0,8.45333207903208,3.8331798242146746,,0,0,0,3.8331798242146746,176.94894781501276,,0,0,0,176.94894781501276,53.21174935843601,,0,0,0,53.21174935843601,17.44397333815074,,0,0,0,17.44397333815074,131.24763296878677,,0,0,0,131.24763296878677
65,ASN,8.424784648651348,,0,0,0,8.424784648651348,4.497154297607948,,0,0,0,4.497154297607948,173.80787301714395,,0,0,0,173.80787301714395,54.495325932245535,,0,0,0,54.495325932245535,38.15198284580419,,0,0,0,38.15198284580419,109.42643134989456,,0,0,0,109.42643134989456
66,GLN,7.813456571678321,,0,0,0,7.813456571678321,4.887714906554557,,0,0,0,4.887714906554557,172.83151887221112,,0,0,0,172.83151887221112,52.91728163872794,,0,0,0,52.91728163872794,31.217152235897437,,0,0,0,31.217152235897437,119.69670038830613,,0,0,0,119.69670038830613
67,PRO,,,0,0,0,,4.62414622962038,,0,0,0,4.62414622962038,176.60177302710625,,0,0,0,176.60177302710625,62.39638322288822,,0,0,0,62.39638322288822,31.61958131650572,,0,0,0,31.61958131650572,,,0,0,0,
68,LEU,8.581078058935509,,0,0,0,8.581078058935509,4.123834445831946,,0,0,0,4.123834445831946,175.390652554218,,0,0,0,175.390652554218,55.121122068503716,,0,0,0,55.121122068503716,42.73383351143301,,0,0,0,42.73383351143301,125.42169437654012,,0,0,0,125.42169437654012
69,GLU,8.804539392646243,,0,0,0,8.804539392646243,4.519971697380397,,0,0,0,4.519971697380397,175.63002223039183,,0,0,0,175.63002223039183,55.17466521060051,,0,0,0,55.17466521060051,31.663376225308024,,0,0,0,31.663376225308024,123.02880093510933,,0,0,0,123.02880093510933
70,VAL,8.735724684537683,,0,0,0,8.735724684537683,4.878277530808081,,0,0,0,4.878277530808081,175.65247532587412,,0,0,0,175.65247532587412,60.86658794193584,,0,0,0,60.86658794193584,33.28392061293151,,0,0,0,33.28392061293151,126.45178307347652,,0,0,0,126.45178307347652
71,VAL,8.904878860550559,,0,0,0,8.904878860550559,4.49480069043734,,0,0,0,4.49480069043734,175.38167780986237,,0,0,0,175.38167780986237,60.051664662326566,,0,0,0,60.051664662326566,35.183488867804414,,0,0,0,35.183488867804414,121.39032796436342,,0,0,0,121.39032796436342
72,TYR,8.51112079088134,,0,0,0,8.51112079088134,5.003817231668331,,0,0,0,5.003817231668331,176.29769225796426,,0,0,0,176.29769225796426,58.86601128875014,,0,0,0,58.86601128875014,38.91055039599844,,0,0,0,38.91055039599844,122.20898405589965,,0,0,0,122.20898405589965
73,SER,9.017687336158287,,0,0,0,9.017687336158287,4.523296704423354,,0,0,0,4.523296704423354,175.2778587474026,,0,0,0,175.2778587474026,58.615085080969024,,0,0,0,58.615085080969024,65.10705364769674,,0,0,0,65.10705364769674,117.53565987885449,,0,0,0,117.53565987885449
74,LYS,8.622887686618936,,0,0,0,8.622887686618936,4.495578848878899,,0,0,0,4.495578848878899,176.54135264298478,,0,0,0,176.54135264298478,56.0731202542291,,0,0,0,56.0731202542291,32.461564471056725,,0,0,0,32.461564471056725,124.50757459444445,,0,0,0,124.50757459444445
75,LEU,7.75762966972472,,0,0,0,7.75762966972472,4.504936651118326,,0,0,0,4.504936651118326,175.35613863540902,,0,0,0,175.35613863540902,53.19330041793207,,0,0,0,53.19330041793207,41.571561397225,,0,0,0,41.571561397225,123.06964218497613,,0,0,0,123.06964218497613
76,PRO,,,0,0,0,,4.484885765678766,,0,0,0,4.484885765678766,177.0253143800644,,0,0,0,177.0253143800644,63.22861236931402,,0,0,0,63.22861236931402,32.188809980957934,,0,0,0,32.188809980957934,,,0,0,0,
77,ALA,7.983033426390277,,0,0,0,7.983033426390277,4.242036342668443,,0,0,0,4.242036342668443,178.9569945315296,,0,0,0,178.9569945315296,53.130766307153955,,0,0,0,53.130766307153955,18.971456714385617,,0,0,0,18.971456714385617,126.14101903262848,,0,0,0,126.14101903262848
