RESNUM,RESNAME,H_X,H_Y,H_BEST_REF_SCORE,H_BEST_REF_COV,H_BEST_REF_MATCH,H_UCBShift,HA_X,HA_Y,HA_BEST_REF_SCORE,HA_BEST_REF_COV,HA_BEST_REF_MATCH,HA_UCBShift,C_X,C_Y,C_BEST_REF_SCORE,C_BEST_REF_COV,C_BEST_REF_MATCH,C_UCBShift,CA_X,CA_Y,CA_BEST_REF_SCORE,CA_BEST_REF_COV,CA_BEST_REF_MATCH,CA_UCBShift,CB_X,CB_Y,CB_BEST_REF_SCORE,CB_BEST_REF_COV,CB_BEST_REF_MATCH,CB_UCBShift,N_X,N_Y,N_BEST_REF_SCORE,N_BEST_REF_COV,N_BEST_REF_MATCH,N_UCBShift
1,MET,8.347096261915862,,0,0,0,8.347096261915862,4.406966042918193,,0,0,0,4.406966042918193,174.9917522810523,,0,0,0,174.9917522810523,55.0965867979576,,0,0,0,55.0965867979576,32.7486228986347,,0,0,0,32.7486228986347,121.31988463739039,,0,0,0,121.31988463739039
2,ALA,8.378598574259074,,0,0,0,8.378598574259074,4.380725814424465,,0,0,0,4.380725814424465,177.54966355182597,,0,0,0,177.54966355182597,52.30928048875569,,0,0,0,52.30928048875569,19.272757657087357,,0,0,0,19.272757657087357,126.6193328993784,,0,0,0,126.6193328993784
3,LYS,8.368753119164168,,0,0,0,8.368753119164168,4.296688151753802,,0,0,0,4.296688151753802,176.18552489406147,,0,0,0,176.18552489406147,55.94249324283494,,0,0,0,55.94249324283494,32.96019198412144,,0,0,0,32.96019198412144,121.9389740328727,,0,0,0,121.9389740328727
4,ALA,8.348794408036408,,0,0,0,8.348794408036408,4.273164174139749,,0,0,0,4.273164174139749,177.4531082955711,,0,0,0,177.4531082955711,52.296895909040956,,0,0,0,52.296895909040956,19.315765743728495,,0,0,0,19.315765743728495,127.00451296801532,,0,0,0,127.00451296801532
5,GLN,8.359177523093573,,0,0,0,8.359177523093573,4.577807181290932,,0,0,0,4.577807181290932,174.0870482025974,,0,0,0,174.0870482025974,53.372663547669,,0,0,0,53.372663547669,28.928707862093464,,0,0,0,28.928707862093464,121.88806948706848,,0,0,0,121.88806948706848
6,PRO,,,0,0,0,,4.704203732905983,,0,0,0,4.704203732905983,176.64786864283496,,0,0,0,176.64786864283496,62.93861450655456,,0,0,0,62.93861450655456,32.46569312746143,,0,0,0,32.46569312746143,,,0,0,0,
7,ILE,8.853884151981353,,0,0,0,8.853884151981353,4.448277313442113,,0,0,0,4.448277313442113,173.8539321190476,,0,0,0,173.8539321190476,60.12894848466534,,0,0,0,60.12894848466534,41.45106263756244,,0,0,0,41.45106263756244,122.27321949384505,,0,0,0,122.27321949384505
8,GLU,8.745189793328894,,0,0,0,8.745189793328894,5.282600944178045,,0,0,0,5.282600944178045,175.73561843432122,,0,0,0,175.73561843432122,55.2916416018315,,0,0,0,55.2916416018315,31.956987315301365,,0,0,0,31.956987315301365,127.32459168720723,,0,0,0,127.32459168720723
9,ILE,8.865878078549228,,0,0,0,8.865878078549228,4.391097531379732,,0,0,0,4.391097531379732,175.49430435613277,,0,0,0,175.49430435613277,60.39877739184704,,0,0,0,60.39877739184704,41.019739862709514,,0,0,0,41.019739862709514,125.33828056167721,,0,0,0,125.33828056167721
10,ALA,9.234746010428461,,0,0,0,9.234746010428461,3.9669918361166614,,0,0,0,3.9669918361166614,177.51568905644356,,0,0,0,177.51568905644356,52.85189708376623,,0,0,0,52.85189708376623,17.453079281879234,,0,0,0,17.453079281879234,132.33952861896992,,0,0,0,132.33952861896992
11,GLY,8.571384877983128,,0,0,0,8.571384877983128,3.778722826071151,,0,0,0,3.778722826071151,173.93392536771006,,0,0,0,173.93392536771006,45.47193179637585,,0,0,0,45.47193179637585,,,0,0,0,,103.4952787591908,,0,0,0,103.4952787591908
12,HIS,8.097145305827507,,0,0,0,8.097145305827507,4.457337059240759,,0,0,0,4.457337059240759,174.12453789371185,,0,0,0,174.12453789371185,54.86026816964147,,0,0,0,54.86026816964147,29.85965938758464,,0,0,0,29.85965938758464,120.51990233351094,,0,0,0,120.51990233351094
13,GLU,8.585854406499056,,0,0,0,8.585854406499056,4.463349662987013,,0,0,0,4.463349662987013,175.16994578575867,,0,0,0,175.16994578575867,56.2268232536519,,0,0,0,56.2268232536519,29.993069128310577,,0,0,0,29.993069128310577,124.78242568151293,,0,0,0,124.78242568151293
14,PHE,9.288296213220114,,0,0,0,9.288296213220114,4.798929983627483,,0,0,0,4.798929983627483,176.0282254603563,,0,0,0,176.0282254603563,56.73541721511822,,0,0,0,56.73541721511822,40.612919300693754,,0,0,0,40.612919300693754,125.95911472649573,,0,0,0,125.95911472649573
15,ALA,9.00035341046731,,0,0,0,9.00035341046731,4.09747272965368,,0,0,0,4.09747272965368,177.08423611389168,,0,0,0,177.08423611389168,54.58184698705739,,0,0,0,54.58184698705739,19.341913415573316,,0,0,0,19.341913415573316,125.87622313419914,,0,0,0,125.87622313419914
16,ARG,7.565852061943612,,0,0,0,7.565852061943612,4.800835344355644,,0,0,0,4.800835344355644,176.7598353504884,,0,0,0,176.7598353504884,54.33576877433122,,0,0,0,54.33576877433122,33.94098037500832,,0,0,0,33.94098037500832,114.46401803342768,,0,0,0,114.46401803342768
17,LYS,8.99747803225663,,0,0,0,8.99747803225663,3.8971780473720723,,0,0,0,3.8971780473720723,177.61136121822065,,0,0,0,177.61136121822065,60.90334444496615,,0,0,0,60.90334444496615,32.3576622421301,,0,0,0,32.3576622421301,124.64345730905207,,0,0,0,124.64345730905207
18,ALA,8.418563328099678,,0,0,0,8.418563328099678,4.1367471254079256,,0,0,0,4.1367471254079256,180.20849126739373,,0,0,0,180.20849126739373,55.13804696363081,,0,0,0,55.13804696363081,18.10509362751693,,0,0,0,18.10509362751693,120.38120170637696,,0,0,0,120.38120170637696
19,ASP,8.139273234065934,,0,0,0,8.139273234065934,4.574990489255189,,0,0,0,4.574990489255189,178.13056627467535,,0,0,0,178.13056627467535,56.920114528149625,,0,0,0,56.920114528149625,41.698740896614495,,0,0,0,41.698740896614495,119.62723170966257,,0,0,0,119.62723170966257
20,ALA,7.88427956014541,,0,0,0,7.88427956014541,2.7112456874347863,,0,0,0,2.7112456874347863,178.9870467840604,,0,0,0,178.9870467840604,54.768067397835495,,0,0,0,54.768067397835495,18.22735648660229,,0,0,0,18.22735648660229,123.15580998861138,,0,0,0,123.15580998861138
21,LEU,8.29119478847264,,0,0,0,8.29119478847264,4.220738626606726,,0,0,0,4.220738626606726,179.24957847807747,,0,0,0,179.24957847807747,58.02274435553335,,0,0,0,58.02274435553335,41.58473015104895,,0,0,0,41.58473015104895,118.06911298230104,,0,0,0,118.06911298230104
22,ALA,7.9620828882173384,,0,0,0,7.9620828882173384,4.129084956882007,,0,0,0,4.129084956882007,179.62566836421914,,0,0,0,179.62566836421914,54.83626608628594,,0,0,0,54.83626608628594,18.240852031418584,,0,0,0,18.240852031418584,122.7579621022533,,0,0,0,122.7579621022533
23,PHE,8.238366212359862,,0,0,0,8.238366212359862,4.08449224531857,,0,0,0,4.08449224531857,177.64775057499168,,0,0,0,177.64775057499168,61.770227877439225,,0,0,0,61.770227877439225,39.68963494699745,,0,0,0,39.68963494699745,120.7268631500333,,0,0,0,120.7268631500333
24,MET,8.558251569103119,,0,0,0,8.558251569103119,3.6809216303668544,,0,0,0,3.6809216303668544,177.7583438465368,,0,0,0,177.7583438465368,60.025862856909754,,0,0,0,60.025862856909754,33.40420116100011,,0,0,0,33.40420116100011,117.99298348918859,,0,0,0,117.99298348918859
25,LYS,8.010582175896324,,0,0,0,8.010582175896324,3.815945970199245,,0,0,0,3.815945970199245,178.63743968710733,,0,0,0,178.63743968710733,59.46193255659896,,0,0,0,59.46193255659896,32.39081157328228,,0,0,0,32.39081157328228,121.8140912509768,,0,0,0,121.8140912509768
26,VAL,7.895642095482295,,0,0,0,7.895642095482295,3.588733213142413,,0,0,0,3.588733213142413,178.28901150886892,,0,0,0,178.28901150886892,65.72611728333334,,0,0,0,65.72611728333334,32.08989501430791,,0,0,0,32.08989501430791,120.13756032700633,,0,0,0,120.13756032700633
27,MET,8.150755165811965,,0,0,0,8.150755165811965,3.9200025133810628,,0,0,0,3.9200025133810628,178.5705815015651,,0,0,0,178.5705815015651,58.96603060128205,,0,0,0,58.96603060128205,33.21226395434565,,0,0,0,33.21226395434565,119.9512656497891,,0,0,0,119.9512656497891
28,LEU,8.628391404645354,,0,0,0,8.628391404645354,3.9646915988455995,,0,0,0,3.9646915988455995,179.02240370875236,,0,0,0,179.02240370875236,58.031154242057944,,0,0,0,58.031154242057944,41.782870663292265,,0,0,0,41.782870663292265,120.55016660392386,,0,0,0,120.55016660392386
29,ASN,8.159772413747364,,0,0,0,8.159772413747364,4.594695406526807,,0,0,0,4.594695406526807,176.80275698261738,,0,0,0,176.80275698261738,55.24720690608836,,0,0,0,55.24720690608836,38.47371415494506,,0,0,0,38.47371415494506,116.35068052959264,,0,0,0,116.35068052959264
30,ARG,7.564052182162283,,0,0,0,7.564052182162283,4.043564215046065,,0,0,0,4.043564215046065,176.30475040268067,,0,0,0,176.30475040268067,57.09887166834277,,0,0,0,57.09887166834277,30.875305830358528,,0,0,0,30.875305830358528,118.80828103697968,,0,0,0,118.80828103697968
31,TYR,7.564441777949828,,0,0,0,7.564441777949828,4.635898298004773,,0,0,0,4.635898298004773,175.5219945414641,,0,0,0,175.5219945414641,57.78927745844155,,0,0,0,57.78927745844155,39.860002115212566,,0,0,0,39.860002115212566,117.84544345902431,,0,0,0,117.84544345902431
32,ARG,8.59317367036852,,0,0,0,8.59317367036852,4.749482566161617,,0,0,0,4.749482566161617,174.24157090344102,,0,0,0,174.24157090344102,53.72069526755467,,0,0,0,53.72069526755467,30.204645006277055,,0,0,0,30.204645006277055,121.33443611688311,,0,0,0,121.33443611688311
33,PRO,,,0,0,0,,4.052384864657565,,0,0,0,4.052384864657565,177.7074799878566,,0,0,0,177.7074799878566,64.34823247353202,,0,0,0,64.34823247353202,31.506717714874014,,0,0,0,31.506717714874014,,,0,0,0,
34,GLY,9.056706531962481,,0,0,0,9.056706531962481,3.8641470080308586,,0,0,0,3.8641470080308586,174.74195171862027,,0,0,0,174.74195171862027,45.04996950704851,,0,0,0,45.04996950704851,,,0,0,0,,113.04088098392162,,0,0,0,113.04088098392162
35,ASP,8.081662317621268,,0,0,0,8.081662317621268,4.733868258191809,,0,0,0,4.733868258191809,175.9192350567932,,0,0,0,175.9192350567932,54.78236171846487,,0,0,0,54.78236171846487,41.74391028573649,,0,0,0,41.74391028573649,121.62582733059163,,0,0,0,121.62582733059163
36,ILE,8.313230025946275,,0,0,0,8.313230025946275,4.44642624401987,,0,0,0,4.44642624401987,176.70229878094128,,0,0,0,176.70229878094128,60.238813115445666,,0,0,0,60.238813115445666,37.49572308270063,,0,0,0,37.49572308270063,122.65055875572762,,0,0,0,122.65055875572762
37,VAL,8.49376983135753,,0,0,0,8.49376983135753,3.3590642151265397,,0,0,0,3.3590642151265397,175.30517288032524,,0,0,0,175.30517288032524,63.199072930164284,,0,0,0,63.199072930164284,32.22040353886114,,0,0,0,32.22040353886114,128.6700529649184,,0,0,0,128.6700529649184
38,SER,8.95923809012099,,0,0,0,8.95923809012099,4.548919894633144,,0,0,0,4.548919894633144,175.58829534862915,,0,0,0,175.58829534862915,58.140320032184476,,0,0,0,58.140320032184476,64.42596146887001,,0,0,0,64.42596146887001,122.65956701778222,,0,0,0,122.65956701778222
39,THR,8.924249481518482,,0,0,0,8.924249481518482,3.983978817943168,,0,0,0,3.983978817943168,176.49549243081916,,0,0,0,176.49549243081916,65.52193362079588,,0,0,0,65.52193362079588,68.44757672903208,,0,0,0,68.44757672903208,117.96538548027527,,0,0,0,117.96538548027527
40,VAL,8.069804605139305,,0,0,0,8.069804605139305,3.801758045399046,,0,0,0,3.801758045399046,177.7227916365357,,0,0,0,177.7227916365357,65.83328159064268,,0,0,0,65.83328159064268,31.619394786574535,,0,0,0,31.619394786574535,121.52612552353203,,0,0,0,121.52612552353203
41,ASP,8.38399651941392,,0,0,0,8.38399651941392,4.528469868919969,,0,0,0,4.528469868919969,178.67962056459098,,0,0,0,178.67962056459098,56.845094163603065,,0,0,0,56.845094163603065,40.45112477759463,,0,0,0,40.45112477759463,121.01628356994672,,0,0,0,121.01628356994672
42,GLY,9.018286686491287,,0,0,0,9.018286686491287,3.7886227624431124,,0,0,0,3.7886227624431124,176.00322526167167,,0,0,0,176.00322526167167,47.30016417362082,,0,0,0,47.30016417362082,,,0,0,0,,108.83624323253413,,0,0,0,108.83624323253413
43,ALA,8.13882853980464,,0,0,0,8.13882853980464,4.134264486124986,,0,0,0,4.134264486124986,179.72782542590744,,0,0,0,179.72782542590744,55.206749973953826,,0,0,0,55.206749973953826,18.060460261799314,,0,0,0,18.060460261799314,124.50566998111887,,0,0,0,124.50566998111887
44,PHE,7.981935302086803,,0,0,0,7.981935302086803,4.113955889704739,,0,0,0,4.113955889704739,177.20675155648797,,0,0,0,177.20675155648797,61.948366275557774,,0,0,0,61.948366275557774,39.67724215892996,,0,0,0,39.67724215892996,120.18155563429347,,0,0,0,120.18155563429347
45,LEU,8.443908330974581,,0,0,0,8.443908330974581,3.7242021717643476,,0,0,0,3.7242021717643476,178.85884793379398,,0,0,0,178.85884793379398,57.72979336105006,,0,0,0,57.72979336105006,40.4063817034299,,0,0,0,40.4063817034299,119.02889732174492,,0,0,0,119.02889732174492
46,VAL,8.69214360042735,,0,0,0,8.69214360042735,3.558342520987347,,0,0,0,3.558342520987347,177.62113042294928,,0,0,0,177.62113042294928,67.3064396988456,,0,0,0,67.3064396988456,31.509576655083805,,0,0,0,31.509576655083805,121.11660997140082,,0,0,0,121.11660997140082
47,GLU,7.844433806571207,,0,0,0,7.844433806571207,3.9933484485014987,,0,0,0,3.9933484485014987,179.26306278830057,,0,0,0,179.26306278830057,58.72989642498613,,0,0,0,58.72989642498613,29.137834444727492,,0,0,0,29.137834444727492,118.78203140303586,,0,0,0,118.78203140303586
48,ALA,8.18829146914197,,0,0,0,8.18829146914197,3.8838095049894554,,0,0,0,3.8838095049894554,179.52982056374182,,0,0,0,179.52982056374182,55.291813298978795,,0,0,0,55.291813298978795,18.25406139733045,,0,0,0,18.25406139733045,122.56345502874903,,0,0,0,122.56345502874903
49,LEU,8.719714766539017,,0,0,0,8.719714766539017,3.8628482312992563,,0,0,0,3.8628482312992563,179.100516998113,,0,0,0,179.100516998113,57.57594852451992,,0,0,0,57.57594852451992,41.518935279526026,,0,0,0,41.518935279526026,120.74863479790764,,0,0,0,120.74863479790764
50,LYS,8.124115034054833,,0,0,0,8.124115034054833,3.9517668805694304,,0,0,0,3.9517668805694304,177.98693647551892,,0,0,0,177.98693647551892,59.04080762481408,,0,0,0,59.04080762481408,32.432156540587194,,0,0,0,32.432156540587194,119.15822594297924,,0,0,0,119.15822594297924
51,ARG,7.327416965578866,,0,0,0,7.327416965578866,4.356960162096237,,0,0,0,4.356960162096237,176.28745313977134,,0,0,0,176.28745313977134,55.98133885138195,,0,0,0,55.98133885138195,30.607657983538683,,0,0,0,30.607657983538683,116.27589629159174,,0,0,0,116.27589629159174
52,HIS,7.743378311743811,,0,0,0,7.743378311743811,4.528979897197248,,0,0,0,4.528979897197248,175.75696681601175,,0,0,0,175.75696681601175,56.31880242968143,,0,0,0,56.31880242968143,31.64585019844045,,0,0,0,31.64585019844045,123.94972872335998,,0,0,0,123.94972872335998
53,PRO,,,0,0,0,,4.296099515545565,,0,0,0,4.296099515545565,177.27306124028195,,0,0,0,177.27306124028195,64.5402007986347,,0,0,0,64.5402007986347,32.02995177752248,,0,0,0,32.02995177752248,,,0,0,0,
54,ASP,8.39286141043956,,0,0,0,8.39286141043956,4.817902762759463,,0,0,0,4.817902762759463,176.73939646219338,,0,0,0,176.73939646219338,54.14056943707404,,0,0,0,54.14056943707404,40.54189450431236,,0,0,0,40.54189450431236,117.72949410036631,,0,0,0,117.72949410036631
55,ALA,8.02964033033078,,0,0,0,8.02964033033078,3.8765416926850924,,0,0,0,3.8765416926850924,178.88811852071262,,0,0,0,178.88811852071262,55.96275074306249,,0,0,0,55.96275074306249,19.238626745621048,,0,0,0,19.238626745621048,123.54110662336552,,0,0,0,123.54110662336552
56,THR,8.363537731718282,,0,0,0,8.363537731718282,3.8466001242840484,,0,0,0,3.8466001242840484,176.5338124542624,,0,0,0,176.5338124542624,66.19408896884781,,0,0,0,66.19408896884781,68.45172587014652,,0,0,0,68.45172587014652,113.64009272616272,,0,0,0,113.64009272616272
57,SER,8.098423477433677,,0,0,0,8.098423477433677,4.345589992044067,,0,0,0,4.345589992044067,176.84551668055278,,0,0,0,176.84551668055278,61.09358509649795,,0,0,0,61.09358509649795,62.93106498777334,,0,0,0,62.93106498777334,117.07626019825175,,0,0,0,117.07626019825175
58,LYS,8.248200534959484,,0,0,0,8.248200534959484,4.117552013075813,,0,0,0,4.117552013075813,179.07161226404705,,0,0,0,179.07161226404705,57.85830885631591,,0,0,0,57.85830885631591,32.05583038554224,,0,0,0,32.05583038554224,122.66825644154734,,0,0,0,122.66825644154734
59,ILE,8.583751684987234,,0,0,0,8.583751684987234,3.70192808986569,,0,0,0,3.70192808986569,177.72706268797313,,0,0,0,177.72706268797313,64.3924555020091,,0,0,0,64.3924555020091,38.24708623793983,,0,0,0,38.24708623793983,121.18423633119659,,0,0,0,121.18423633119659
60,GLY,8.004454896026196,,0,0,0,8.004454896026196,3.974116644072594,,0,0,0,3.974116644072594,174.35131883301142,,0,0,0,174.35131883301142,45.60215321717727,,0,0,0,45.60215321717727,,,0,0,0,,107.79837281361971,,0,0,0,107.79837281361971
61,PRO,,,0,0,0,,4.465105976950827,,0,0,0,4.465105976950827,176.40537395664336,,0,0,0,176.40537395664336,63.60382662438672,,0,0,0,63.60382662438672,32.10483408754024,,0,0,0,32.10483408754024,,,0,0,0,
62,GLY,8.085559086430237,,0,0,0,8.085559086430237,4.033969695931846,,0,0,0,4.033969695931846,172.42483065474525,,0,0,0,172.42483065474525,44.92865846088911,,0,0,0,44.92865846088911,,,0,0,0,,108.97938171783771,,0,0,0,108.97938171783771
63,VAL,8.565817924081474,,0,0,0,8.565817924081474,3.841970366089465,,0,0,0,3.841970366089465,175.39554678643023,,0,0,0,175.39554678643023,63.08346916270396,,0,0,0,63.08346916270396,31.937150243184593,,0,0,0,31.937150243184593,122.15264808348874,,0,0,0,122.15264808348874
64,ARG,8.880130887984238,,0,0,0,8.880130887984238,4.287634098778999,,0,0,0,4.287634098778999,176.3084155883006,,0,0,0,176.3084155883006,57.29874279387279,,0,0,0,57.29874279387279,31.259054564296815,,0,0,0,31.259054564296815,129.65912470229216,,0,0,0,129.65912470229216
65,ASN,7.921196743922744,,0,0,0,7.921196743922744,4.790923743173494,,0,0,0,4.790923743173494,172.51697861612274,,0,0,0,172.51697861612274,52.17370637767788,,0,0,0,52.17370637767788,42.878602538106335,,0,0,0,42.878602538106335,113.21345610809192,,0,0,0,113.21345610809192
66,PHE,9.167999257969809,,0,0,0,9.167999257969809,5.790820817937618,,0,0,0,5.790820817937618,175.3023989254246,,0,0,0,175.3023989254246,56.43727935913531,,0,0,0,56.43727935913531,42.990878019180826,,0,0,0,42.990878019180826,118.73838144956154,,0,0,0,118.73838144956154
67,GLU,9.520924455966256,,0,0,0,9.520924455966256,5.251088207531358,,0,0,0,5.251088207531358,175.10329825906317,,0,0,0,175.10329825906317,54.48107528602509,,0,0,0,54.48107528602509,34.33895592728938,,0,0,0,34.33895592728938,123.21542071444667,,0,0,0,123.21542071444667
68,VAL,9.126255904856254,,0,0,0,9.126255904856254,4.811144131318681,,0,0,0,4.811144131318681,175.22401544614274,,0,0,0,175.22401544614274,61.852484920079924,,0,0,0,61.852484920079924,32.21376742877678,,0,0,0,32.21376742877678,125.17530712009658,,0,0,0,125.17530712009658
69,ARG,9.013039867049617,,0,0,0,9.013039867049617,4.847550500055499,,0,0,0,4.847550500055499,175.1900904914752,,0,0,0,175.1900904914752,53.97726462544122,,0,0,0,53.97726462544122,33.750367315201466,,0,0,0,33.750367315201466,127.71049132812743,,0,0,0,127.71049132812743
70,SER,8.495567290526141,,0,0,0,8.495567290526141,4.768587831091131,,0,0,0,4.768587831091131,175.1887333041736,,0,0,0,175.1887333041736,58.309036809457204,,0,0,0,58.309036809457204,63.605236200582745,,0,0,0,63.605236200582745,117.28571102652903,,0,0,0,117.28571102652903
71,ALA,8.634629705289155,,0,0,0,8.634629705289155,4.588355281074481,,0,0,0,4.588355281074481,176.86318359437786,,0,0,0,176.86318359437786,51.43735331091686,,0,0,0,51.43735331091686,20.740983660633812,,0,0,0,20.740983660633812,127.75643697001887,,0,0,0,127.75643697001887
72,ASP,8.667245875446776,,0,0,0,8.667245875446776,4.431299546320346,,0,0,0,4.431299546320346,177.05178292235544,,0,0,0,177.05178292235544,55.525428296176045,,0,0,0,55.525428296176045,41.01993602242202,,0,0,0,41.01993602242202,119.23097755757577,,0,0,0,119.23097755757577
73,TYR,8.320223059645908,,0,0,0,8.320223059645908,4.240634542993118,,0,0,0,4.240634542993118,176.35243174115885,,0,0,0,176.35243174115885,59.01794813764013,,0,0,0,59.01794813764013,37.11276234163614,,0,0,0,37.11276234163614,118.70962193191252,,0,0,0,118.70962193191252
74,GLY,8.334650740381841,,0,0,0,8.334650740381841,3.9232513753135763,,0,0,0,3.9232513753135763,174.50623992382063,,0,0,0,174.50623992382063,45.663692385353535,,0,0,0,45.663692385353535,,,0,0,0,,107.13989811149406,,0,0,0,107.13989811149406
75,THR,7.548809246908648,,0,0,0,7.548809246908648,4.527881783236208,,0,0,0,4.527881783236208,174.328712598557,,0,0,0,174.328712598557,61.67847561340326,,0,0,0,61.67847561340326,70.94154344005439,,0,0,0,70.94154344005439,112.70518754036519,,0,0,0,112.70518754036519
76,GLN,8.532029784354535,,0,0,0,8.532029784354535,5.24505518072483,,0,0,0,5.24505518072483,175.2044065147186,,0,0,0,175.2044065147186,54.687143292118996,,0,0,0,54.687143292118996,31.819715022166726,,0,0,0,31.819715022166726,121.19628431230991,,0,0,0,121.19628431230991
77,CYS,9.035464662909314,,0,0,0,9.035464662909314,4.74960922989233,,0,0,0,4.74960922989233,172.93144291591742,,0,0,0,172.93144291591742,57.37727903247863,,0,0,0,57.37727903247863,31.99035703907759,,0,0,0,31.99035703907759,118.18055427896547,,0,0,0,118.18055427896547
78,PHE,8.679533094050395,,0,0,0,8.679533094050395,5.255842790043289,,0,0,0,5.255842790043289,174.65933756489622,,0,0,0,174.65933756489622,57.24828845846376,,0,0,0,57.24828845846376,40.742835935225884,,0,0,0,40.742835935225884,119.15963180767011,,0,0,0,119.15963180767011
79,TRP,9.496833449173048,,0,0,0,9.496833449173048,5.2257229101176605,,0,0,0,5.2257229101176605,175.52397169632033,,0,0,0,175.52397169632033,56.02048742283827,,0,0,0,56.02048742283827,31.920757987362634,,0,0,0,31.920757987362634,122.13194068287822,,0,0,0,122.13194068287822
80,ILE,9.692995152486402,,0,0,0,9.692995152486402,4.278498963988789,,0,0,0,4.278498963988789,175.3029918311633,,0,0,0,175.3029918311633,60.8699076530303,,0,0,0,60.8699076530303,38.95716144626485,,0,0,0,38.95716144626485,123.4574010910201,,0,0,0,123.4574010910201
81,LEU,9.102491625496725,,0,0,0,9.102491625496725,4.79281562945388,,0,0,0,4.79281562945388,175.79056347855476,,0,0,0,175.79056347855476,54.438449106754355,,0,0,0,54.438449106754355,41.920913230974584,,0,0,0,41.920913230974584,128.67130373578644,,0,0,0,128.67130373578644
82,ARG,8.838979343972694,,0,0,0,8.838979343972694,5.278574595709845,,0,0,0,5.278574595709845,178.06165676020646,,0,0,0,178.06165676020646,55.08730692964258,,0,0,0,55.08730692964258,32.159668722915974,,0,0,0,32.159668722915974,124.1531024073149,,0,0,0,124.1531024073149
83,THR,8.551956423426574,,0,0,0,8.551956423426574,4.1326383760905765,,0,0,0,4.1326383760905765,175.46240304891774,,0,0,0,175.46240304891774,64.47155124015428,,0,0,0,64.47155124015428,68.82327878858364,,0,0,0,68.82327878858364,113.63640377221667,,0,0,0,113.63640377221667
84,ASP,7.912370364213564,,0,0,0,7.912370364213564,4.623350461008436,,0,0,0,4.623350461008436,177.18282254543792,,0,0,0,177.18282254543792,53.634622244433345,,0,0,0,53.634622244433345,40.13112573871129,,0,0,0,40.13112573871129,119.22670176931958,,0,0,0,119.22670176931958
85,GLY,8.085437775091576,,0,0,0,8.085437775091576,3.971436522974248,,0,0,0,3.971436522974248,174.5634218336719,,0,0,0,174.5634218336719,45.1343297492896,,0,0,0,45.1343297492896,,,0,0,0,,108.78167047484737,,0,0,0,108.78167047484737
86,SER,7.992263540659342,,0,0,0,7.992263540659342,4.523138739072039,,0,0,0,4.523138739072039,173.10401507838273,,0,0,0,173.10401507838273,58.43468366257631,,0,0,0,58.43468366257631,64.64392438351648,,0,0,0,64.64392438351648,117.44367759363969,,0,0,0,117.44367759363969
87,GLU,8.627884237534687,,0,0,0,8.627884237534687,5.439811506815406,,0,0,0,5.439811506815406,175.96822266668332,,0,0,0,175.96822266668332,54.775869616933065,,0,0,0,54.775869616933065,32.70177906006771,,0,0,0,32.70177906006771,120.9248649847597,,0,0,0,120.9248649847597
88,GLU,9.131461258186258,,0,0,0,9.131461258186258,4.619039716677767,,0,0,0,4.619039716677767,175.04932524390054,,0,0,0,175.04932524390054,55.01819546833167,,0,0,0,55.01819546833167,33.39304688871128,,0,0,0,33.39304688871128,122.77124737149518,,0,0,0,122.77124737149518
89,ARG,8.034500928460428,,0,0,0,8.034500928460428,4.438424741713842,,0,0,0,4.438424741713842,175.11415033423245,,0,0,0,175.11415033423245,55.59926188348318,,0,0,0,55.59926188348318,31.361153526884227,,0,0,0,31.361153526884227,123.14034907661782,,0,0,0,123.14034907661782