RESNUM,RESNAME,H_X,H_Y,H_BEST_REF_SCORE,H_BEST_REF_COV,H_BEST_REF_MATCH,H_UCBShift,HA_X,HA_Y,HA_BEST_REF_SCORE,HA_BEST_REF_COV,HA_BEST_REF_MATCH,HA_UCBShift,C_X,C_Y,C_BEST_REF_SCORE,C_BEST_REF_COV,C_BEST_REF_MATCH,C_UCBShift,CA_X,CA_Y,CA_BEST_REF_SCORE,CA_BEST_REF_COV,CA_BEST_REF_MATCH,CA_UCBShift,CB_X,CB_Y,CB_BEST_REF_SCORE,CB_BEST_REF_COV,CB_BEST_REF_MATCH,CB_UCBShift,N_X,N_Y,N_BEST_REF_SCORE,N_BEST_REF_COV,N_BEST_REF_MATCH,N_UCBShift
1,MET,8.321355562132311,,0,0,0,8.321355562132311,4.36248886983017,,0,0,0,4.36248886983017,174.65027430793097,,0,0,0,174.65027430793097,55.25083080718171,,0,0,0,55.25083080718171,32.833729936402484,,0,0,0,32.833729936402484,120.99829360833056,,0,0,0,120.99829360833056
2,LYS,8.38320970122655,,0,0,0,8.38320970122655,4.4400294443500945,,0,0,0,4.4400294443500945,176.00809247808303,,0,0,0,176.00809247808303,56.124033554262404,,0,0,0,56.124033554262404,33.208634735409035,,0,0,0,33.208634735409035,123.24502832748918,,0,0,0,123.24502832748918
3,LYS,8.334130106299256,,0,0,0,8.334130106299256,4.396343247996448,,0,0,0,4.396343247996448,175.61132931904206,,0,0,0,175.61132931904206,55.93395867843823,,0,0,0,55.93395867843823,32.98721365621046,,0,0,0,32.98721365621046,122.28022829090355,,0,0,0,122.28022829090355
4,LEU,8.245513048773448,,0,0,0,8.245513048773448,4.403584995909646,,0,0,0,4.403584995909646,176.31520522969808,,0,0,0,176.31520522969808,54.866627309346214,,0,0,0,54.866627309346214,42.48953559097569,,0,0,0,42.48953559097569,124.06534892163391,,0,0,0,124.06534892163391
5,VAL,8.029542998923299,,0,0,0,8.029542998923299,4.242187198995449,,0,0,0,4.242187198995449,175.61403137756133,,0,0,0,175.61403137756133,62.08229552810523,,0,0,0,62.08229552810523,32.79587897381507,,0,0,0,32.79587897381507,121.82603200520036,,0,0,0,121.82603200520036
6,THR,8.270854257470308,,0,0,0,8.270854257470308,4.3437911993339995,,0,0,0,4.3437911993339995,174.19150217249415,,0,0,0,174.19150217249415,61.480890668642466,,0,0,0,61.480890668642466,69.5825277478799,,0,0,0,69.5825277478799,119.9990072128316,,0,0,0,119.9990072128316
7,ALA,8.277175172377623,,0,0,0,8.277175172377623,4.369234157756133,,0,0,0,4.369234157756133,177.11707098041404,,0,0,0,177.11707098041404,52.123861385125984,,0,0,0,52.123861385125984,19.04759528798979,,0,0,0,19.04759528798979,128.05661584408924,,0,0,0,128.05661584408924
8,THR,8.215634002392052,,0,0,0,8.215634002392052,4.3697355524364525,,0,0,0,4.3697355524364525,174.9402909852259,,0,0,0,174.9402909852259,61.65844419511599,,0,0,0,61.65844419511599,69.64105188927739,,0,0,0,69.64105188927739,115.51356319193029,,0,0,0,115.51356319193029
9,THR,8.163628933671884,,0,0,0,8.163628933671884,4.281546129797979,,0,0,0,4.281546129797979,174.39182521292594,,0,0,0,174.39182521292594,62.05480655962371,,0,0,0,62.05480655962371,69.67455461737707,,0,0,0,69.67455461737707,118.18275026701076,,0,0,0,118.18275026701076
10,LEU,8.19342453867799,,0,0,0,8.19342453867799,4.274818707894883,,0,0,0,4.274818707894883,176.97523244612054,,0,0,0,176.97523244612054,55.09429345477856,,0,0,0,55.09429345477856,42.563779211211006,,0,0,0,42.563779211211006,124.82551814264625,,0,0,0,124.82551814264625
11,THR,8.171002364685314,,0,0,0,8.171002364685314,4.329577083649683,,0,0,0,4.329577083649683,173.91458956468531,,0,0,0,173.91458956468531,61.80185326578421,,0,0,0,61.80185326578421,69.79845081438006,,0,0,0,69.79845081438006,116.77823226562326,,0,0,0,116.77823226562326
12,ALA,8.321180797602398,,0,0,0,8.321180797602398,4.27808867490565,,0,0,0,4.27808867490565,177.4717454850705,,0,0,0,177.4717454850705,52.313633468392716,,0,0,0,52.313633468392716,18.948686300715952,,0,0,0,18.948686300715952,128.44582121422465,,0,0,0,128.44582121422465
13,GLY,8.394951838866689,,0,0,0,8.394951838866689,3.880849325610501,,0,0,0,3.880849325610501,174.230034460767,,0,0,0,174.230034460767,44.932684930830284,,0,0,0,44.932684930830284,,,0,0,0,,110.67646712773893,,0,0,0,110.67646712773893
14,ILE,8.084244393645244,,0,0,0,8.084244393645244,3.964452260836386,,0,0,0,3.964452260836386,175.55276623097458,,0,0,0,175.55276623097458,61.16320806500166,,0,0,0,61.16320806500166,38.856776048556995,,0,0,0,38.856776048556995,121.9727271984793,,0,0,0,121.9727271984793
15,GLY,8.431923656188257,,0,0,0,8.431923656188257,3.9077581367854366,,0,0,0,3.9077581367854366,173.65751719744145,,0,0,0,173.65751719744145,45.51847447218337,,0,0,0,45.51847447218337,,,0,0,0,,116.01754095412365,,0,0,0,116.01754095412365
16,ALA,8.244525825557776,,0,0,0,8.244525825557776,4.571844098484849,,0,0,0,4.571844098484849,176.95667277435342,,0,0,0,176.95667277435342,52.178850804179156,,0,0,0,52.178850804179156,19.220467106804307,,0,0,0,19.220467106804307,124.61915750392386,,0,0,0,124.61915750392386
17,ALA,8.355517437401488,,0,0,0,8.355517437401488,4.250658125357975,,0,0,0,4.250658125357975,177.2205885467366,,0,0,0,177.2205885467366,52.617366495521146,,0,0,0,52.617366495521146,19.106282640576094,,0,0,0,19.106282640576094,124.86774457641802,,0,0,0,124.86774457641802
18,ILE,7.939888101215451,,0,0,0,7.939888101215451,4.398803721456321,,0,0,0,4.398803721456321,175.00919099239096,,0,0,0,175.00919099239096,60.53810716931402,,0,0,0,60.53810716931402,39.34880594236319,,0,0,0,39.34880594236319,120.34904684336774,,0,0,0,120.34904684336774
19,VAL,8.155158105394605,,0,0,0,8.155158105394605,4.123189543509268,,0,0,0,4.123189543509268,176.1065567539183,,0,0,0,176.1065567539183,62.07496472945388,,0,0,0,62.07496472945388,32.73124056169941,,0,0,0,32.73124056169941,123.10532364405594,,0,0,0,123.10532364405594
20,GLY,8.385096637728937,,0,0,0,8.385096637728937,3.861574432309357,,0,0,0,3.861574432309357,173.46300709784106,,0,0,0,173.46300709784106,45.09524761202686,,0,0,0,45.09524761202686,,,0,0,0,,114.46769289012099,,0,0,0,114.46769289012099
21,LEU,8.201222267177267,,0,0,0,8.201222267177267,4.462807949017649,,0,0,0,4.462807949017649,176.78764319634809,,0,0,0,176.78764319634809,54.48480920732046,,0,0,0,54.48480920732046,43.70433418771784,,0,0,0,43.70433418771784,123.20768290542235,,0,0,0,123.20768290542235
22,ASP,8.440334925086026,,0,0,0,8.440334925086026,4.628337211294261,,0,0,0,4.628337211294261,175.38105594673107,,0,0,0,175.38105594673107,54.25659837371518,,0,0,0,54.25659837371518,40.782174711322014,,0,0,0,40.782174711322014,121.54476018417694,,0,0,0,121.54476018417694
23,HIS,8.171720934149183,,0,0,0,8.171720934149183,4.328358205422355,,0,0,0,4.328358205422355,174.48759556085025,,0,0,0,174.48759556085025,55.65895107234432,,0,0,0,55.65895107234432,29.19872078051948,,0,0,0,29.19872078051948,118.32361942933179,,0,0,0,118.32361942933179
24,GLY,8.280435811338661,,0,0,0,8.280435811338661,3.9178760636308136,,0,0,0,3.9178760636308136,173.59769338827283,,0,0,0,173.59769338827283,45.67022344393384,,0,0,0,45.67022344393384,,,0,0,0,,110.07968992916527,,0,0,0,110.07968992916527
25,ASN,8.41357507854923,,0,0,0,8.41357507854923,4.798927931202131,,0,0,0,4.798927931202131,174.69775061884226,,0,0,0,174.69775061884226,52.945357475224775,,0,0,0,52.945357475224775,38.752390583361084,,0,0,0,38.752390583361084,119.88376272276058,,0,0,0,119.88376272276058
26,GLU,8.127062688594739,,0,0,0,8.127062688594739,4.44054304575147,,0,0,0,4.44054304575147,175.60082703897214,,0,0,0,175.60082703897214,56.78786292861583,,0,0,0,56.78786292861583,29.676159315134864,,0,0,0,29.676159315134864,122.7247812954268,,0,0,0,122.7247812954268
27,ALA,8.08785447899323,,0,0,0,8.08785447899323,4.386912260722611,,0,0,0,4.386912260722611,176.47857635424577,,0,0,0,176.47857635424577,52.507005207714506,,0,0,0,52.507005207714506,20.012717476517928,,0,0,0,20.012717476517928,125.06604773867244,,0,0,0,125.06604773867244
28,ASP,8.240121945215895,,0,0,0,8.240121945215895,4.564186620565546,,0,0,0,4.564186620565546,175.8380224832834,,0,0,0,175.8380224832834,54.215714380652685,,0,0,0,54.215714380652685,41.80460915966811,,0,0,0,41.80460915966811,121.82353034183039,,0,0,0,121.82353034183039
29,ALA,8.263573913331113,,0,0,0,8.263573913331113,4.39362878432401,,0,0,0,4.39362878432401,176.6330425794539,,0,0,0,176.6330425794539,52.30249122299367,,0,0,0,52.30249122299367,19.188951014507715,,0,0,0,19.188951014507715,125.52220480959596,,0,0,0,125.52220480959596
30,ALA,8.204393903552004,,0,0,0,8.204393903552004,4.303507086915862,,0,0,0,4.303507086915862,177.34792727386503,,0,0,0,177.34792727386503,52.615863844105895,,0,0,0,52.615863844105895,20.178108353779557,,0,0,0,20.178108353779557,124.85788739188034,,0,0,0,124.85788739188034
31,GLU,8.377829381290931,,0,0,0,8.377829381290931,4.216143630280829,,0,0,0,4.216143630280829,175.97300905749805,,0,0,0,175.97300905749805,56.50996973192918,,0,0,0,56.50996973192918,30.027085766722166,,0,0,0,30.027085766722166,121.40954542015763,,0,0,0,121.40954542015763
32,GLN,8.42817500877456,,0,0,0,8.42817500877456,4.229924123562548,,0,0,0,4.229924123562548,175.73551743021423,,0,0,0,175.73551743021423,56.023530980969035,,0,0,0,56.023530980969035,29.482807518087466,,0,0,0,29.482807518087466,121.85208684592074,,0,0,0,121.85208684592074
33,THR,8.330565226984127,,0,0,0,8.330565226984127,4.271840509615385,,0,0,0,4.271840509615385,173.9412453458819,,0,0,0,173.9412453458819,61.85119296510711,,0,0,0,61.85119296510711,69.67494110230881,,0,0,0,69.67494110230881,116.2566759605894,,0,0,0,116.2566759605894
34,GLN,8.043916222804972,,0,0,0,8.043916222804972,4.5367381327589085,,0,0,0,4.5367381327589085,173.5113074902209,,0,0,0,173.5113074902209,53.689078293228995,,0,0,0,53.689078293228995,29.72830043956599,,0,0,0,29.72830043956599,123.82691867881562,,0,0,0,123.82691867881562
35,PRO,,,0,0,0,,4.514756822580198,,0,0,0,4.514756822580198,176.6361039020202,,0,0,0,176.6361039020202,62.93283845975136,,0,0,0,62.93283845975136,31.882080990720393,,0,0,0,31.882080990720393,,,0,0,0,
36,THR,8.110321750638251,,0,0,0,8.110321750638251,4.277169964160839,,0,0,0,4.277169964160839,174.21999608826727,,0,0,0,174.21999608826727,61.84119794983905,,0,0,0,61.84119794983905,69.67858588104673,,0,0,0,69.67858588104673,115.38142134430014,,0,0,0,115.38142134430014
37,ASN,8.421452997224998,,0,0,0,8.421452997224998,4.45922185393773,,0,0,0,4.45922185393773,174.56473543639692,,0,0,0,174.56473543639692,53.27765303869464,,0,0,0,53.27765303869464,38.66112515914086,,0,0,0,38.66112515914086,121.10429274545454,,0,0,0,121.10429274545454
38,GLN,8.359680526146077,,0,0,0,8.359680526146077,4.373796833991009,,0,0,0,4.373796833991009,175.2235611508658,,0,0,0,175.2235611508658,55.4552890996892,,0,0,0,55.4552890996892,29.933048037773336,,0,0,0,29.933048037773336,121.70651954652014,,0,0,0,121.70651954652014
39,SER,8.35329248038073,,0,0,0,8.35329248038073,4.4827972799145295,,0,0,0,4.4827972799145295,174.0114160255411,,0,0,0,174.0114160255411,58.37979362756133,,0,0,0,58.37979362756133,63.69890612410922,,0,0,0,63.69890612410922,118.11779443194028,,0,0,0,118.11779443194028
40,THR,8.078263842685093,,0,0,0,8.078263842685093,4.441445589890665,,0,0,0,4.441445589890665,174.22302415151515,,0,0,0,174.22302415151515,61.37786093169053,,0,0,0,61.37786093169053,70.03973853579754,,0,0,0,70.03973853579754,117.85868388288932,,0,0,0,117.85868388288932
41,THR,8.226503897324898,,0,0,0,8.226503897324898,4.242014498357198,,0,0,0,4.242014498357198,174.4028414756299,,0,0,0,174.4028414756299,62.32407111514596,,0,0,0,62.32407111514596,69.76549301785991,,0,0,0,69.76549301785991,118.12852076328672,,0,0,0,118.12852076328672
42,GLN,8.317355717832168,,0,0,0,8.317355717832168,4.478268260833611,,0,0,0,4.478268260833611,175.4042272580586,,0,0,0,175.4042272580586,55.490291432778335,,0,0,0,55.490291432778335,29.896428734826284,,0,0,0,29.896428734826284,124.51105631849816,,0,0,0,124.51105631849816
43,SER,8.391361313619715,,0,0,0,8.391361313619715,4.4333705551226545,,0,0,0,4.4333705551226545,174.36065937000222,,0,0,0,174.36065937000222,58.211374284293484,,0,0,0,58.211374284293484,63.60071810877456,,0,0,0,63.60071810877456,118.5168418999112,,0,0,0,118.5168418999112
44,THR,8.083626612959263,,0,0,0,8.083626612959263,4.379770692418692,,0,0,0,4.379770692418692,174.44593467988676,,0,0,0,174.44593467988676,60.98735215391275,,0,0,0,60.98735215391275,69.81952310894661,,0,0,0,69.81952310894661,116.49574487303252,,0,0,0,116.49574487303252
45,SER,8.487582150921302,,0,0,0,8.487582150921302,4.373899893983793,,0,0,0,4.373899893983793,174.47583748780107,,0,0,0,174.47583748780107,58.70269462647907,,0,0,0,58.70269462647907,63.08959267081252,,0,0,0,63.08959267081252,120.12610586536798,,0,0,0,120.12610586536798
46,GLY,8.32150871937507,,0,0,0,8.32150871937507,3.9227111377761137,,0,0,0,3.9227111377761137,174.1177950482018,,0,0,0,174.1177950482018,45.08141615187035,,0,0,0,45.08141615187035,,,0,0,0,,110.69761310888,,0,0,0,110.69761310888
47,SER,8.433976833050284,,0,0,0,8.433976833050284,4.425903520324121,,0,0,0,4.425903520324121,174.4663755578366,,0,0,0,174.4663755578366,58.05344034575424,,0,0,0,58.05344034575424,63.266534623953824,,0,0,0,63.266534623953824,118.47512469054278,,0,0,0,118.47512469054278
48,SER,8.252643167837718,,0,0,0,8.252643167837718,4.4311740737484735,,0,0,0,4.4311740737484735,174.634110806993,,0,0,0,174.634110806993,58.96232344817405,,0,0,0,58.96232344817405,63.644311759373956,,0,0,0,63.644311759373956,119.01827647502498,,0,0,0,119.01827647502498
49,ALA,8.410666595615496,,0,0,0,8.410666595615496,4.241317392690643,,0,0,0,4.241317392690643,177.36590642743369,,0,0,0,177.36590642743369,52.313997234371186,,0,0,0,52.313997234371186,19.280432365179266,,0,0,0,19.280432365179266,126.74255762677322,,0,0,0,126.74255762677322
50,ASN,8.510404769025419,,0,0,0,8.510404769025419,3.9745632260794763,,0,0,0,3.9745632260794763,175.44882179143633,,0,0,0,175.44882179143633,52.86347820899656,,0,0,0,52.86347820899656,38.408310869064266,,0,0,0,38.408310869064266,120.68424237596292,,0,0,0,120.68424237596292
51,LEU,7.786051232800533,,0,0,0,7.786051232800533,4.201436907964259,,0,0,0,4.201436907964259,177.62716824270728,,0,0,0,177.62716824270728,55.217349362099014,,0,0,0,55.217349362099014,42.188950436219336,,0,0,0,42.188950436219336,124.67363738140193,,0,0,0,124.67363738140193
52,TYR,7.989531815329115,,0,0,0,7.989531815329115,4.639371860950161,,0,0,0,4.639371860950161,176.16374344143634,,0,0,0,176.16374344143634,57.333403326462424,,0,0,0,57.333403326462424,39.08360316418581,,0,0,0,39.08360316418581,118.87381816774891,,0,0,0,118.87381816774891
53,THR,8.612617648146298,,0,0,0,8.612617648146298,4.26934852542735,,0,0,0,4.26934852542735,174.03206198259517,,0,0,0,174.03206198259517,62.67857708515928,,0,0,0,62.67857708515928,69.90085739842935,,0,0,0,69.90085739842935,117.37874517430902,,0,0,0,117.37874517430902
54,ALA,8.408614386485736,,0,0,0,8.408614386485736,3.358678487851038,,0,0,0,3.358678487851038,178.2583198372905,,0,0,0,178.2583198372905,53.54897255446775,,0,0,0,53.54897255446775,18.119844624975027,,0,0,0,18.119844624975027,129.37095634947275,,0,0,0,129.37095634947275
55,GLY,7.811588047014097,,0,0,0,7.811588047014097,2.939685599658673,,0,0,0,2.939685599658673,174.11287377478078,,0,0,0,174.11287377478078,44.95076183094683,,0,0,0,44.95076183094683,,,0,0,0,,110.60579384316239,,0,0,0,110.60579384316239
56,GLN,7.860883604451105,,0,0,0,7.860883604451105,4.489286998285048,,0,0,0,4.489286998285048,176.82613157412032,,0,0,0,176.82613157412032,54.371550963897214,,0,0,0,54.371550963897214,30.379785039521586,,0,0,0,30.379785039521586,118.88038273612499,,0,0,0,118.88038273612499
57,CYS,9.029363475269175,,0,0,0,9.029363475269175,4.169794930674881,,0,0,0,4.169794930674881,175.87523039871795,,0,0,0,175.87523039871795,61.747294226606726,,0,0,0,61.747294226606726,27.44665332090132,,0,0,0,27.44665332090132,120.51984482350981,,0,0,0,120.51984482350981
58,THR,8.347716965978465,,0,0,0,8.347716965978465,3.500120374730825,,0,0,0,3.500120374730825,175.77821778393272,,0,0,0,175.77821778393272,65.54553021217116,,0,0,0,65.54553021217116,67.75878655527251,,0,0,0,67.75878655527251,112.49122598657453,,0,0,0,112.49122598657453
59,TRP,7.607751251293152,,0,0,0,7.607751251293152,4.299302818858919,,0,0,0,4.299302818858919,178.43549153692973,,0,0,0,178.43549153692973,61.109422408419356,,0,0,0,61.109422408419356,29.554577465134866,,0,0,0,29.554577465134866,124.61709156201576,,0,0,0,124.61709156201576
60,TYR,8.482679808180707,,0,0,0,8.482679808180707,3.993241768631369,,0,0,0,3.993241768631369,177.01280761812632,,0,0,0,177.01280761812632,62.28086763317238,,0,0,0,62.28086763317238,38.74235472445887,,0,0,0,38.74235472445887,120.98508191919191,,0,0,0,120.98508191919191
61,VAL,8.813847527927628,,0,0,0,8.813847527927628,3.4070882416389168,,0,0,0,3.4070882416389168,177.86500597560217,,0,0,0,177.86500597560217,67.13282646556776,,0,0,0,67.13282646556776,31.522704396281497,,0,0,0,31.522704396281497,119.40564113052503,,0,0,0,119.40564113052503
62,TYR,8.890792556665556,,0,0,0,8.890792556665556,3.8171042016206016,,0,0,0,3.8171042016206016,176.86493529133645,,0,0,0,176.86493529133645,62.18841313967699,,0,0,0,62.18841313967699,38.8562273565268,,0,0,0,38.8562273565268,120.75825318961594,,0,0,0,120.75825318961594
63,ASP,8.28887861968587,,0,0,0,8.28887861968587,4.122578190434566,,0,0,0,4.122578190434566,178.5947191806527,,0,0,0,178.5947191806527,57.628746373987134,,0,0,0,57.628746373987134,41.37964198041403,,0,0,0,41.37964198041403,118.88730591189366,,0,0,0,118.88730591189366
64,LYS,8.089380897208347,,0,0,0,8.089380897208347,3.7286811008824507,,0,0,0,3.7286811008824507,178.56352672298812,,0,0,0,178.56352672298812,58.22949499595405,,0,0,0,58.22949499595405,30.912479970351868,,0,0,0,30.912479970351868,121.19991737875458,,0,0,0,121.19991737875458
65,VAL,7.873233762742812,,0,0,0,7.873233762742812,4.427382386544012,,0,0,0,4.427382386544012,175.64521790229216,,0,0,0,175.64521790229216,61.036630794544344,,0,0,0,61.036630794544344,31.35740832109002,,0,0,0,31.35740832109002,110.33903168196248,,0,0,0,110.33903168196248
66,GLY,7.659134736308136,,0,0,0,7.659134736308136,3.799846389801865,,0,0,0,3.799846389801865,175.4240289934177,,0,0,0,175.4240289934177,46.06294246017316,,0,0,0,46.06294246017316,,,0,0,0,,108.3578982479354,,0,0,0,108.3578982479354
67,GLY,8.070963148351648,,0,0,0,8.070963148351648,3.0869701238705725,,0,0,0,3.0869701238705725,175.01172371460763,,0,0,0,175.01172371460763,45.38139919532689,,0,0,0,45.38139919532689,,,0,0,0,,107.35224464787434,,0,0,0,107.35224464787434
68,ASN,7.460518504811855,,0,0,0,7.460518504811855,4.542445704584305,,0,0,0,4.542445704584305,173.78326629472193,,0,0,0,173.78326629472193,54.10287970458985,,0,0,0,54.10287970458985,38.75304799024864,,0,0,0,38.75304799024864,116.66525227408702,,0,0,0,116.66525227408702
69,ILE,6.55685132134532,,0,0,0,6.55685132134532,4.206619848865024,,0,0,0,4.206619848865024,174.21348535652126,,0,0,0,174.21348535652126,59.09257614513265,,0,0,0,59.09257614513265,39.77546704448329,,0,0,0,39.77546704448329,109.60477151687756,,0,0,0,109.60477151687756
70,GLY,6.5441012244699746,,0,0,0,6.5441012244699746,3.683764526923076,,0,0,0,3.683764526923076,174.3335108532745,,0,0,0,174.3335108532745,44.92800253568654,,0,0,0,44.92800253568654,,,0,0,0,,110.69891161836496,,0,0,0,110.69891161836496
71,SER,8.466935835581086,,0,0,0,8.466935835581086,3.8629236737651236,,0,0,0,3.8629236737651236,174.34390084815183,,0,0,0,174.34390084815183,59.945095664063714,,0,0,0,59.945095664063714,62.78769837193362,,0,0,0,62.78769837193362,118.75552743732933,,0,0,0,118.75552743732933
72,THR,7.541046944499945,,0,0,0,7.541046944499945,4.364693889022089,,0,0,0,4.364693889022089,175.41360008870018,,0,0,0,175.41360008870018,61.73032701257076,,0,0,0,61.73032701257076,69.22193536446886,,0,0,0,69.22193536446886,110.79148218992118,,0,0,0,110.79148218992118
73,TRP,7.71920367933733,,0,0,0,7.71920367933733,4.639275804423354,,0,0,0,4.639275804423354,176.70528848297258,,0,0,0,176.70528848297258,56.91056129158619,,0,0,0,56.91056129158619,29.458987301520704,,0,0,0,29.458987301520704,121.81939824194694,,0,0,0,121.81939824194694
74,GLY,8.016701254018203,,0,0,0,8.016701254018203,4.09965565903541,,0,0,0,4.09965565903541,174.0686500989233,,0,0,0,174.0686500989233,45.43363571658897,,0,0,0,45.43363571658897,,,0,0,0,,108.36268524019314,,0,0,0,108.36268524019314
75,ASN,8.739312013530915,,0,0,0,8.739312013530915,4.73602780959596,,0,0,0,4.73602780959596,176.73406043770117,,0,0,0,176.73406043770117,52.989940231013435,,0,0,0,52.989940231013435,39.221232585148186,,0,0,0,39.221232585148186,121.50999037728938,,0,0,0,121.50999037728938
76,ALA,8.807655176196027,,0,0,0,8.807655176196027,3.50295582079587,,0,0,0,3.50295582079587,179.24979405839161,,0,0,0,179.24979405839161,55.561469054673104,,0,0,0,55.561469054673104,18.27263552749473,,0,0,0,18.27263552749473,124.92956898578089,,0,0,0,124.92956898578089
77,ASN,8.344424008080809,,0,0,0,8.344424008080809,4.413016761186037,,0,0,0,4.413016761186037,175.751936493118,,0,0,0,175.751936493118,54.89288844293484,,0,0,0,54.89288844293484,37.25242126139971,,0,0,0,37.25242126139971,113.46980698757909,,0,0,0,113.46980698757909
78,ASN,8.060980403457654,,0,0,0,8.060980403457654,4.843573172205573,,0,0,0,4.843573172205573,176.36530381602284,,0,0,0,176.36530381602284,53.58378123536463,,0,0,0,53.58378123536463,39.24342439667554,,0,0,0,39.24342439667554,116.68513798233988,,0,0,0,116.68513798233988
79,TRP,8.135486426645576,,0,0,0,8.135486426645576,4.241374133777334,,0,0,0,4.241374133777334,177.379668829859,,0,0,0,177.379668829859,59.33306714653125,,0,0,0,59.33306714653125,28.972271311188813,,0,0,0,28.972271311188813,121.13511922837162,,0,0,0,121.13511922837162
80,ALA,8.744873312043513,,0,0,0,8.744873312043513,3.8257368987706744,,0,0,0,3.8257368987706744,179.11390443767345,,0,0,0,179.11390443767345,55.452241622827174,,0,0,0,55.452241622827174,18.08299723656899,,0,0,0,18.08299723656899,120.71443149376734,,0,0,0,120.71443149376734
81,SER,8.115082183311134,,0,0,0,8.115082183311134,4.230971082395382,,0,0,0,4.230971082395382,176.8129483639749,,0,0,0,176.8129483639749,61.43246381660561,,0,0,0,61.43246381660561,62.74000946305916,,0,0,0,62.74000946305916,113.69427086565656,,0,0,0,113.69427086565656
82,ALA,8.204553025324676,,0,0,0,8.204553025324676,3.972419628893329,,0,0,0,3.972419628893329,179.87824628977134,,0,0,0,179.87824628977134,54.576323071084474,,0,0,0,54.576323071084474,17.610747622166727,,0,0,0,17.610747622166727,125.09542877125097,,0,0,0,125.09542877125097
83,ALA,8.517721843462093,,0,0,0,8.517721843462093,3.487467085564436,,0,0,0,3.487467085564436,179.1024935319625,,0,0,0,179.1024935319625,54.86435821330336,,0,0,0,54.86435821330336,17.911547519402824,,0,0,0,17.911547519402824,121.2486286004884,,0,0,0,121.2486286004884
84,SER,8.228611714457765,,0,0,0,8.228611714457765,4.320777632400932,,0,0,0,4.320777632400932,178.38084355814186,,0,0,0,178.38084355814186,61.25334920616605,,0,0,0,61.25334920616605,62.92816578050838,,0,0,0,62.92816578050838,113.9557173987346,,0,0,0,113.9557173987346
85,SER,7.999958595154846,,0,0,0,7.999958595154846,4.2921017150183145,,0,0,0,4.2921017150183145,175.87943095059939,,0,0,0,175.87943095059939,60.92471292123432,,0,0,0,60.92471292123432,62.937489690337436,,0,0,0,62.937489690337436,117.65019252884893,,0,0,0,117.65019252884893
86,ALA,7.705939273826173,,0,0,0,7.705939273826173,4.416856748318349,,0,0,0,4.416856748318349,178.02377890689866,,0,0,0,178.02377890689866,52.61289938957154,,0,0,0,52.61289938957154,19.417259783238986,,0,0,0,19.417259783238986,122.93991542338772,,0,0,0,122.93991542338772
87,GLY,7.804341161832611,,0,0,0,7.804341161832611,3.842635546334221,,0,0,0,3.842635546334221,175.27204308355533,,0,0,0,175.27204308355533,45.25900834121434,,0,0,0,45.25900834121434,,,0,0,0,,105.89585418386058,,0,0,0,105.89585418386058
88,TYR,8.08706383139083,,0,0,0,8.08706383139083,4.585345648878899,,0,0,0,4.585345648878899,176.15289810162616,,0,0,0,176.15289810162616,58.27855417312687,,0,0,0,58.27855417312687,39.52201196185481,,0,0,0,39.52201196185481,120.82574677657342,,0,0,0,120.82574677657342
89,THR,8.445091864441116,,0,0,0,8.445091864441116,4.552920402469752,,0,0,0,4.552920402469752,173.55665104506048,,0,0,0,173.55665104506048,61.990688944022644,,0,0,0,61.990688944022644,69.90496682705073,,0,0,0,69.90496682705073,118.94727334713619,,0,0,0,118.94727334713619