RESNUM,RESNAME,H_X,H_Y,H_BEST_REF_SCORE,H_BEST_REF_COV,H_BEST_REF_MATCH,H_UCBShift,HA_X,HA_Y,HA_BEST_REF_SCORE,HA_BEST_REF_COV,HA_BEST_REF_MATCH,HA_UCBShift,C_X,C_Y,C_BEST_REF_SCORE,C_BEST_REF_COV,C_BEST_REF_MATCH,C_UCBShift,CA_X,CA_Y,CA_BEST_REF_SCORE,CA_BEST_REF_COV,CA_BEST_REF_MATCH,CA_UCBShift,CB_X,CB_Y,CB_BEST_REF_SCORE,CB_BEST_REF_COV,CB_BEST_REF_MATCH,CB_UCBShift,N_X,N_Y,N_BEST_REF_SCORE,N_BEST_REF_COV,N_BEST_REF_MATCH,N_UCBShift
1,MET,8.48193003913864,,0,0,0,8.48193003913864,4.342769605255855,,0,0,0,4.342769605255855,174.3480557786103,,0,0,0,174.3480557786103,55.17765027279942,,0,0,0,55.17765027279942,33.24221411218226,,0,0,0,33.24221411218226,120.65743046601176,,0,0,0,120.65743046601176
2,ILE,8.31367893976024,,0,0,0,8.31367893976024,5.0446053622877125,,0,0,0,5.0446053622877125,175.6604074328727,,0,0,0,175.6604074328727,59.40428974003219,,0,0,0,59.40428974003219,39.38545034305139,,0,0,0,39.38545034305139,123.6529186059607,,0,0,0,123.6529186059607
3,GLU,8.811326685625485,,0,0,0,8.811326685625485,4.695607080863581,,0,0,0,4.695607080863581,173.42559521729936,,0,0,0,173.42559521729936,52.3997663453602,,0,0,0,52.3997663453602,32.33744587067932,,0,0,0,32.33744587067932,125.56162002963148,,0,0,0,125.56162002963148
4,PRO,,,0,0,0,,4.88150640966256,,0,0,0,4.88150640966256,176.5023865841825,,0,0,0,176.5023865841825,62.329874454595405,,0,0,0,62.329874454595405,32.05404107905983,,0,0,0,32.05404107905983,,,0,0,0,
5,ILE,8.676708608130758,,0,0,0,8.676708608130758,4.629955396847597,,0,0,0,4.629955396847597,174.68562767582418,,0,0,0,174.68562767582418,59.50256672668998,,0,0,0,59.50256672668998,41.766139069880126,,0,0,0,41.766139069880126,118.47058335288045,,0,0,0,118.47058335288045
6,LYS,8.490566458502608,,0,0,0,8.490566458502608,5.39373992061827,,0,0,0,5.39373992061827,175.26548301668885,,0,0,0,175.26548301668885,55.04734690726496,,0,0,0,55.04734690726496,35.166488714796316,,0,0,0,35.166488714796316,122.10888805414031,,0,0,0,122.10888805414031
7,ARG,8.824799764568764,,0,0,0,8.824799764568764,4.743422614685314,,0,0,0,4.743422614685314,174.25478696014542,,0,0,0,174.25478696014542,54.75338511176046,,0,0,0,54.75338511176046,32.26099570579421,,0,0,0,32.26099570579421,122.23507678865023,,0,0,0,122.23507678865023
8,THR,8.627873587323787,,0,0,0,8.627873587323787,5.329385893906093,,0,0,0,5.329385893906093,173.75614181090575,,0,0,0,173.75614181090575,61.45598366114996,,0,0,0,61.45598366114996,70.79185402312687,,0,0,0,70.79185402312687,117.91860835577755,,0,0,0,117.91860835577755
9,GLN,9.033164647446998,,0,0,0,9.033164647446998,4.564183634765235,,0,0,0,4.564183634765235,173.94637999366745,,0,0,0,173.94637999366745,53.969155966095016,,0,0,0,53.969155966095016,30.610191376462424,,0,0,0,30.610191376462424,127.40641957916527,,0,0,0,127.40641957916527
10,VAL,8.37821957149517,,0,0,0,8.37821957149517,5.080746423593074,,0,0,0,5.080746423593074,175.88495909251304,,0,0,0,175.88495909251304,61.09370833077478,,0,0,0,61.09370833077478,33.42647236163281,,0,0,0,33.42647236163281,126.1351365979576,,0,0,0,126.1351365979576
11,VAL,9.476466082095682,,0,0,0,9.476466082095682,4.585168897879898,,0,0,0,4.585168897879898,175.09026542116217,,0,0,0,175.09026542116217,60.82000054282939,,0,0,0,60.82000054282939,33.71468797694528,,0,0,0,33.71468797694528,129.09200980219225,,0,0,0,129.09200980219225
12,THR,8.97409848069153,,0,0,0,8.97409848069153,5.2603911577589075,,0,0,0,5.2603911577589075,173.89364896847042,,0,0,0,173.89364896847042,61.62855643246198,,0,0,0,61.62855643246198,70.50438053364968,,0,0,0,70.50438053364968,124.38434398175158,,0,0,0,124.38434398175158
13,GLN,9.020647272460872,,0,0,0,9.020647272460872,4.741423909118659,,0,0,0,4.741423909118659,174.32952975040516,,0,0,0,174.32952975040516,53.2873527984793,,0,0,0,53.2873527984793,30.69421659190809,,0,0,0,30.69421659190809,128.66115557720056,,0,0,0,128.66115557720056
14,THR,8.879704341919194,,0,0,0,8.879704341919194,4.988145664635364,,0,0,0,4.988145664635364,173.65512669980575,,0,0,0,173.65512669980575,61.79993326878122,,0,0,0,61.79993326878122,70.01455997254968,,0,0,0,70.01455997254968,123.81811088829504,,0,0,0,123.81811088829504
15,ILE,9.203805687506936,,0,0,0,9.203805687506936,4.52743320890221,,0,0,0,4.52743320890221,174.5642415159618,,0,0,0,174.5642415159618,60.16760122863248,,0,0,0,60.16760122863248,39.516925395315795,,0,0,0,39.516925395315795,126.65046511762682,,0,0,0,126.65046511762682
16,HIS,9.075102084987234,,0,0,0,9.075102084987234,4.583998397585747,,0,0,0,4.583998397585747,173.6897471813853,,0,0,0,173.6897471813853,54.56719071819292,,0,0,0,54.56719071819292,30.77413361596737,,0,0,0,30.77413361596737,125.89534645483405,,0,0,0,125.89534645483405
17,TYR,8.81322336062826,,0,0,0,8.81322336062826,5.503273088272839,,0,0,0,5.503273088272839,175.95661819801865,,0,0,0,175.95661819801865,57.11616711374181,,0,0,0,57.11616711374181,39.43892816941392,,0,0,0,39.43892816941392,122.64883449030968,,0,0,0,122.64883449030968
18,ARG,9.123723037512487,,0,0,0,9.123723037512487,5.2013971123099125,,0,0,0,5.2013971123099125,175.29463136982463,,0,0,0,175.29463136982463,53.44256305934066,,0,0,0,53.44256305934066,34.29287167160062,,0,0,0,34.29287167160062,123.00471888149073,,0,0,0,123.00471888149073
19,TYR,9.018883923154622,,0,0,0,9.018883923154622,5.386155913830613,,0,0,0,5.386155913830613,178.23738307869908,,0,0,0,178.23738307869908,57.716154405339104,,0,0,0,57.716154405339104,39.87160339148629,,0,0,0,39.87160339148629,120.3481630020535,,0,0,0,120.3481630020535
20,GLU,8.893275487101787,,0,0,0,8.893275487101787,4.103760644960595,,0,0,0,4.103760644960595,176.438570016872,,0,0,0,176.438570016872,59.238792581673884,,0,0,0,59.238792581673884,29.447357448201796,,0,0,0,29.447357448201796,121.21699707338217,,0,0,0,121.21699707338217
21,ASP,8.187458142468643,,0,0,0,8.187458142468643,4.653036751778777,,0,0,0,4.653036751778777,177.07728503755135,,0,0,0,177.07728503755135,53.67806684463314,,0,0,0,53.67806684463314,40.02116212424798,,0,0,0,40.02116212424798,118.3558900562937,,0,0,0,118.3558900562937
22,GLY,8.193779828049728,,0,0,0,8.193779828049728,3.9576179182151194,,0,0,0,3.9576179182151194,173.5709022128982,,0,0,0,173.5709022128982,45.54636884707515,,0,0,0,45.54636884707515,,,0,0,0,,108.79521985759796,,0,0,0,108.79521985759796
23,ALA,8.320741098185149,,0,0,0,8.320741098185149,4.317571344583195,,0,0,0,4.317571344583195,177.2738830029304,,0,0,0,177.2738830029304,52.46416187115107,,0,0,0,52.46416187115107,20.109441433599734,,0,0,0,20.109441433599734,123.9953289006438,,0,0,0,123.9953289006438
24,VAL,8.523034827999778,,0,0,0,8.523034827999778,4.008841935198135,,0,0,0,4.008841935198135,175.88087067682318,,0,0,0,175.88087067682318,63.69284558200133,,0,0,0,63.69284558200133,32.189264798668,,0,0,0,32.189264798668,120.95172133994895,,0,0,0,120.95172133994895
25,ALA,8.826512151198802,,0,0,0,8.826512151198802,3.791993121497947,,0,0,0,3.791993121497947,176.34271778037518,,0,0,0,176.34271778037518,52.43937947103452,,0,0,0,52.43937947103452,19.156241275241428,,0,0,0,19.156241275241428,131.3090812613331,,0,0,0,131.3090812613331
26,HIS,7.767151598068598,,0,0,0,7.767151598068598,4.472889970651571,,0,0,0,4.472889970651571,172.9459123268842,,0,0,0,172.9459123268842,55.101653214019315,,0,0,0,55.101653214019315,32.29339991394161,,0,0,0,32.29339991394161,115.09094354022089,,0,0,0,115.09094354022089
27,ASP,8.424800333705184,,0,0,0,8.424800333705184,4.608775813064713,,0,0,0,4.608775813064713,175.91524242334887,,0,0,0,175.91524242334887,55.06639739649795,,0,0,0,55.06639739649795,41.47291767160063,,0,0,0,41.47291767160063,122.32942004374515,,0,0,0,122.32942004374515
28,ASP,8.631908515140415,,0,0,0,8.631908515140415,5.107312954101454,,0,0,0,5.107312954101454,175.96245784192476,,0,0,0,175.96245784192476,54.87210792511932,,0,0,0,54.87210792511932,41.146147784282384,,0,0,0,41.146147784282384,122.13352721620046,,0,0,0,122.13352721620046
29,HIS,8.836776123570873,,0,0,0,8.836776123570873,4.881166833122432,,0,0,0,4.881166833122432,173.64368487709513,,0,0,0,173.64368487709513,55.25239803377733,,0,0,0,55.25239803377733,30.9436997991231,,0,0,0,30.9436997991231,122.36997746162726,,0,0,0,122.36997746162726
30,VAL,8.348440586846486,,0,0,0,8.348440586846486,4.85574708017538,,0,0,0,4.85574708017538,175.31072455478966,,0,0,0,175.31072455478966,61.43065095344656,,0,0,0,61.43065095344656,33.485157286213784,,0,0,0,33.485157286213784,126.71626011635587,,0,0,0,126.71626011635587
31,VAL,9.037308589205239,,0,0,0,9.037308589205239,4.678240092551892,,0,0,0,4.678240092551892,174.09832621873682,,0,0,0,174.09832621873682,60.4247398509546,,0,0,0,60.4247398509546,35.31484613996559,,0,0,0,35.31484613996559,124.58143526451882,,0,0,0,124.58143526451882
32,SER,8.538827602458653,,0,0,0,8.538827602458653,5.58672239960595,,0,0,0,5.58672239960595,173.37203868465977,,0,0,0,173.37203868465977,56.85096024094794,,0,0,0,56.85096024094794,65.26048823635253,,0,0,0,65.26048823635253,120.32739086041737,,0,0,0,120.32739086041737
33,LEU,9.20880266935842,,0,0,0,9.20880266935842,4.6396646501221,,0,0,0,4.6396646501221,175.26432848366633,,0,0,0,175.26432848366633,53.41960371657232,,0,0,0,53.41960371657232,43.78172376522367,,0,0,0,43.78172376522367,125.7950468530414,,0,0,0,125.7950468530414
34,ILE,8.266923094061495,,0,0,0,8.266923094061495,4.644343662748363,,0,0,0,4.644343662748363,175.19394923906648,,0,0,0,175.19394923906648,60.474536282095684,,0,0,0,60.474536282095684,39.186746860023305,,0,0,0,39.186746860023305,121.64306523394384,,0,0,0,121.64306523394384
35,PHE,9.491122852935954,,0,0,0,9.491122852935954,5.006513303818403,,0,0,0,5.006513303818403,175.04160608629704,,0,0,0,175.04160608629704,56.3201684522755,,0,0,0,56.3201684522755,41.23105904862915,,0,0,0,41.23105904862915,127.90664398560327,,0,0,0,127.90664398560327
36,THR,8.88220133892774,,0,0,0,8.88220133892774,5.259766235753135,,0,0,0,5.259766235753135,173.24896275217003,,0,0,0,173.24896275217003,61.851696813414364,,0,0,0,61.851696813414364,70.65346138803419,,0,0,0,70.65346138803419,119.30668298730158,,0,0,0,119.30668298730158
37,GLN,8.708644454395605,,0,0,0,8.708644454395605,3.930009625579975,,0,0,0,3.930009625579975,174.03950302829946,,0,0,0,174.03950302829946,53.57362486202131,,0,0,0,53.57362486202131,30.70384992958708,,0,0,0,30.70384992958708,127.3136965606449,,0,0,0,127.3136965606449
38,SER,8.65740422796648,,0,0,0,8.65740422796648,5.02874087019647,,0,0,0,5.02874087019647,174.05138884674213,,0,0,0,174.05138884674213,57.98124807231657,,0,0,0,57.98124807231657,64.7923379021201,,0,0,0,64.7923379021201,121.71890949385059,,0,0,0,121.71890949385059
39,GLY,8.842283507187258,,0,0,0,8.842283507187258,3.825223127677877,,0,0,0,3.825223127677877,172.13850433529248,,0,0,0,172.13850433529248,45.06616955580531,,0,0,0,45.06616955580531,,,0,0,0,,110.15164612526362,,0,0,0,110.15164612526362
40,LYS,8.561211262670662,,0,0,0,8.561211262670662,5.032116446137197,,0,0,0,5.032116446137197,174.5072640274281,,0,0,0,174.5072640274281,54.743421562703965,,0,0,0,54.743421562703965,36.55435994456655,,0,0,0,36.55435994456655,120.30635657318793,,0,0,0,120.30635657318793
41,ARG,8.867937972055723,,0,0,0,8.867937972055723,4.923001386402486,,0,0,0,4.923001386402486,175.0901426786991,,0,0,0,175.0901426786991,54.317616509679205,,0,0,0,54.317616509679205,33.24046484979465,,0,0,0,33.24046484979465,124.28828776779886,,0,0,0,124.28828776779886
42,ASP,8.834731471572871,,0,0,0,8.834731471572871,4.784625647630148,,0,0,0,4.784625647630148,177.08701518759574,,0,0,0,177.08701518759574,54.090222316633366,,0,0,0,54.090222316633366,42.61136726666667,,0,0,0,42.61136726666667,128.0165936002553,,0,0,0,128.0165936002553
43,LEU,8.992850654312354,,0,0,0,8.992850654312354,4.217242602419803,,0,0,0,4.217242602419803,178.5244788121545,,0,0,0,178.5244788121545,56.57434019269619,,0,0,0,56.57434019269619,41.64809528117993,,0,0,0,41.64809528117993,127.25990169831834,,0,0,0,127.25990169831834
44,THR,7.734540022144523,,0,0,0,7.734540022144523,4.236206398454323,,0,0,0,4.236206398454323,175.50088095854144,,0,0,0,175.50088095854144,64.44740337079587,,0,0,0,64.44740337079587,69.32097377342102,,0,0,0,69.32097377342102,113.04869344794649,,0,0,0,113.04869344794649
45,ASN,8.104115132933734,,0,0,0,8.104115132933734,4.724830298196249,,0,0,0,4.724830298196249,176.25160155739815,,0,0,0,176.25160155739815,52.43660108156843,,0,0,0,52.43660108156843,39.10130961303141,,0,0,0,39.10130961303141,118.07233203735154,,0,0,0,118.07233203735154
46,GLY,8.166959322222223,,0,0,0,8.166959322222223,3.8625221044150297,,0,0,0,3.8625221044150297,174.19440249875126,,0,0,0,174.19440249875126,45.90668776489622,,0,0,0,45.90668776489622,,,0,0,0,,109.33284090026085,,0,0,0,109.33284090026085
47,LYS,8.257911868492618,,0,0,0,8.257911868492618,4.25207601001221,,0,0,0,4.25207601001221,176.03583008903874,,0,0,0,176.03583008903874,56.33592383554224,,0,0,0,56.33592383554224,32.93448611756577,,0,0,0,32.93448611756577,121.49691740538906,,0,0,0,121.49691740538906
48,GLU,8.62804142950383,,0,0,0,8.62804142950383,4.654759096520146,,0,0,0,4.654759096520146,175.9155789049284,,0,0,0,175.9155789049284,55.74824306017871,,0,0,0,55.74824306017871,31.2431404981574,,0,0,0,31.2431404981574,125.64878007804973,,0,0,0,125.64878007804973
49,ILE,8.777675719430569,,0,0,0,8.777675719430569,4.450215312826063,,0,0,0,4.450215312826063,174.5187005292541,,0,0,0,174.5187005292541,60.39326128791209,,0,0,0,60.39326128791209,39.675972527411474,,0,0,0,39.675972527411474,122.79671990952936,,0,0,0,122.79671990952936
50,TRP,8.829911657176158,,0,0,0,8.829911657176158,4.7845909604839605,,0,0,0,4.7845909604839605,175.3577624304473,,0,0,0,175.3577624304473,56.964303413281165,,0,0,0,56.964303413281165,30.285341570973472,,0,0,0,30.285341570973472,127.69156929151404,,0,0,0,127.69156929151404
51,ASP,8.669220267088468,,0,0,0,8.669220267088468,4.722558309160284,,0,0,0,4.722558309160284,177.17836926056722,,0,0,0,177.17836926056722,54.16733418093573,,0,0,0,54.16733418093573,41.608614011116664,,0,0,0,41.608614011116664,122.9346714495005,,0,0,0,122.9346714495005
52,SER,8.609911912420912,,0,0,0,8.609911912420912,4.377621984310134,,0,0,0,4.377621984310134,175.62263907644024,,0,0,0,175.62263907644024,60.517873751997996,,0,0,0,60.517873751997996,63.20649369748585,,0,0,0,63.20649369748585,120.85316485075481,,0,0,0,120.85316485075481
53,LYS,8.030535193739594,,0,0,0,8.030535193739594,4.36657321053946,,0,0,0,4.36657321053946,176.57760236950273,,0,0,0,176.57760236950273,56.12494661023421,,0,0,0,56.12494661023421,32.557755501315356,,0,0,0,32.557755501315356,119.85435923189588,,0,0,0,119.85435923189588
54,TRP,7.904445865356864,,0,0,0,7.904445865356864,4.2923456861749365,,0,0,0,4.2923456861749365,174.62193424100343,,0,0,0,174.62193424100343,58.80256335626041,,0,0,0,58.80256335626041,30.348850820568323,,0,0,0,30.348850820568323,124.25020934401154,,0,0,0,124.25020934401154
55,SER,7.83478038957154,,0,0,0,7.83478038957154,4.590635733805084,,0,0,0,4.590635733805084,172.35049812333222,,0,0,0,172.35049812333222,56.88357219340104,,0,0,0,56.88357219340104,65.27090463935508,,0,0,0,65.27090463935508,120.63777141978576,,0,0,0,120.63777141978576
56,LEU,8.87540465956821,,0,0,0,8.87540465956821,4.57357641975802,,0,0,0,4.57357641975802,174.91970467297145,,0,0,0,174.91970467297145,54.09325751146076,,0,0,0,54.09325751146076,45.32692471127206,,0,0,0,45.32692471127206,127.24184747274947,,0,0,0,127.24184747274947
57,THR,8.430278113492063,,0,0,0,8.430278113492063,5.252064143162393,,0,0,0,5.252064143162393,173.8560172007104,,0,0,0,173.8560172007104,61.78661268270063,,0,0,0,61.78661268270063,69.93236317040737,,0,0,0,69.93236317040737,124.36721560384616,,0,0,0,124.36721560384616
58,GLN,9.04601387057942,,0,0,0,9.04601387057942,4.576846180780331,,0,0,0,4.576846180780331,173.99905971479632,,0,0,0,173.99905971479632,54.35546549859585,,0,0,0,54.35546549859585,32.657857348368296,,0,0,0,32.657857348368296,124.1907059543845,,0,0,0,124.1907059543845
59,THR,8.349604853429904,,0,0,0,8.349604853429904,5.0019133250360746,,0,0,0,5.0019133250360746,173.90746840429014,,0,0,0,173.90746840429014,61.46229176694971,,0,0,0,61.46229176694971,70.83177070755356,,0,0,0,70.83177070755356,117.69443264081474,,0,0,0,117.69443264081474
60,PHE,9.189879114141414,,0,0,0,9.189879114141414,4.753691854445553,,0,0,0,4.753691854445553,175.86812480153736,,0,0,0,175.86812480153736,57.75284966863137,,0,0,0,57.75284966863137,39.651950641719395,,0,0,0,39.651950641719395,125.82582168757354,,0,0,0,125.82582168757354
61,GLU,8.985818367071817,,0,0,0,8.985818367071817,4.207965493043068,,0,0,0,4.207965493043068,176.26336144620933,,0,0,0,176.26336144620933,56.49698064717505,,0,0,0,56.49698064717505,30.207424687745586,,0,0,0,30.207424687745586,123.1756688943279,,0,0,0,123.1756688943279
62,ALA,8.456181345326895,,0,0,0,8.456181345326895,4.696885166627817,,0,0,0,4.696885166627817,177.19410458327783,,0,0,0,177.19410458327783,52.40995948233433,,0,0,0,52.40995948233433,19.17736096769897,,0,0,0,19.17736096769897,124.11964061028971,,0,0,0,124.11964061028971
63,LEU,8.933244840637142,,0,0,0,8.933244840637142,4.9724863608447105,,0,0,0,4.9724863608447105,173.74145656925296,,0,0,0,173.74145656925296,51.64541975495061,,0,0,0,51.64541975495061,43.980861573160176,,0,0,0,43.980861573160176,125.74229057508047,,0,0,0,125.74229057508047
64,PRO,,,0,0,0,,4.651888312432012,,0,0,0,4.651888312432012,176.61029485476192,,0,0,0,176.61029485476192,62.457388236113886,,0,0,0,62.457388236113886,31.932236610594963,,0,0,0,31.932236610594963,,,0,0,0,
65,SER,8.490533386058386,,0,0,0,8.490533386058386,4.71922375448163,,0,0,0,4.71922375448163,172.89688453252302,,0,0,0,172.89688453252302,57.707640505666554,,0,0,0,57.707640505666554,63.02023103648018,,0,0,0,63.02023103648018,120.10307717181706,,0,0,0,120.10307717181706
66,PRO,,,0,0,0,,4.317289043972694,,0,0,0,4.317289043972694,177.46972896116108,,0,0,0,177.46972896116108,63.10133484278499,,0,0,0,63.10133484278499,31.763318944244645,,0,0,0,31.763318944244645,,,0,0,0,
67,VAL,8.390208296936397,,0,0,0,8.390208296936397,4.0742096951770455,,0,0,0,4.0742096951770455,176.2323979415307,,0,0,0,176.2323979415307,62.6086129937951,,0,0,0,62.6086129937951,32.17477862822178,,0,0,0,32.17477862822178,122.52404750118771,,0,0,0,122.52404750118771
68,ILE,8.322996120551672,,0,0,0,8.322996120551672,4.270990909240759,,0,0,0,4.270990909240759,175.78932681412476,,0,0,0,175.78932681412476,60.35281794775225,,0,0,0,60.35281794775225,38.709022944244644,,0,0,0,38.709022944244644,126.87123667433679,,0,0,0,126.87123667433679
69,ILE,8.644326847496947,,0,0,0,8.644326847496947,3.6959312999889002,,0,0,0,3.6959312999889002,177.42803502160618,,0,0,0,177.42803502160618,62.85960756148296,,0,0,0,62.85960756148296,36.88209741785437,,0,0,0,36.88209741785437,128.34522435960707,,0,0,0,128.34522435960707
70,GLY,8.728611005688755,,0,0,0,8.728611005688755,3.9453546371212123,,0,0,0,3.9453546371212123,173.852548402664,,0,0,0,173.852548402664,45.49928790361305,,0,0,0,45.49928790361305,,,0,0,0,,114.33444666391941,,0,0,0,114.33444666391941
71,TYR,8.215828297741147,,0,0,0,8.215828297741147,5.351992953923855,,0,0,0,5.351992953923855,174.88205485743146,,0,0,0,174.88205485743146,57.09297991900322,,0,0,0,57.09297991900322,42.014454479759124,,0,0,0,42.014454479759124,120.35021843369964,,0,0,0,120.35021843369964
72,THR,8.959366173137973,,0,0,0,8.959366173137973,4.803707708563659,,0,0,0,4.803707708563659,173.59716822878787,,0,0,0,173.59716822878787,61.31562624811855,,0,0,0,61.31562624811855,71.0193575059274,,0,0,0,71.0193575059274,118.01969693342214,,0,0,0,118.01969693342214
73,ALA,8.815099425313575,,0,0,0,8.815099425313575,4.001547050571651,,0,0,0,4.001547050571651,177.23288032488622,,0,0,0,177.23288032488622,51.99724098888334,,0,0,0,51.99724098888334,19.03583120936841,,0,0,0,19.03583120936841,129.11081355062714,,0,0,0,129.11081355062714
74,ASP,8.86319729028749,,0,0,0,8.86319729028749,4.459940552772228,,0,0,0,4.459940552772228,176.3116195848041,,0,0,0,176.3116195848041,55.849387072483076,,0,0,0,55.849387072483076,41.115808225518926,,0,0,0,41.115808225518926,122.76900435754246,,0,0,0,122.76900435754246
75,LYS,7.8126919098124095,,0,0,0,7.8126919098124095,4.771279321922521,,0,0,0,4.771279321922521,174.50989694854036,,0,0,0,174.50989694854036,53.26769513599179,,0,0,0,53.26769513599179,33.677962539282944,,0,0,0,33.677962539282944,119.34990237338772,,0,0,0,119.34990237338772
76,PRO,,,0,0,0,,4.447541891272616,,0,0,0,4.447541891272616,176.5766729148407,,0,0,0,176.5766729148407,64.3824483539516,,0,0,0,64.3824483539516,32.269046010106564,,0,0,0,32.269046010106564,,,0,0,0,
77,MET,7.636865373981573,,0,0,0,7.636865373981573,5.069275495282495,,0,0,0,5.069275495282495,174.36122002939283,,0,0,0,174.36122002939283,54.467375665634364,,0,0,0,54.467375665634364,35.10405983900544,,0,0,0,35.10405983900544,115.75197553235652,,0,0,0,115.75197553235652
78,VAL,8.998984046353646,,0,0,0,8.998984046353646,4.357581395387945,,0,0,0,4.357581395387945,175.69232301555667,,0,0,0,175.69232301555667,61.45427323256188,,0,0,0,61.45427323256188,33.92864808556443,,0,0,0,33.92864808556443,126.09665194178044,,0,0,0,126.09665194178044
79,GLY,8.68928628823954,,0,0,0,8.68928628823954,4.065116580827506,,0,0,0,4.065116580827506,173.23225644011544,,0,0,0,173.23225644011544,44.4226804483017,,0,0,0,44.4226804483017,,,0,0,0,,114.70329736456321,,0,0,0,114.70329736456321
80,PRO,,,0,0,0,,4.669659192485293,,0,0,0,4.669659192485293,176.33636257751695,,0,0,0,176.33636257751695,62.75765599101454,,0,0,0,62.75765599101454,33.20133112262737,,0,0,0,33.20133112262737,,,0,0,0,
81,ASP,8.696738452347653,,0,0,0,8.696738452347653,4.953987443639694,,0,0,0,4.953987443639694,174.29943666915307,,0,0,0,174.29943666915307,53.36509451906982,,0,0,0,53.36509451906982,43.63722220426796,,0,0,0,43.63722220426796,122.1323784863359,,0,0,0,122.1323784863359
82,GLU,8.803063736269287,,0,0,0,8.803063736269287,4.871925734859585,,0,0,0,4.871925734859585,175.54980160205903,,0,0,0,175.54980160205903,56.709007575518925,,0,0,0,56.709007575518925,31.136947838150736,,0,0,0,31.136947838150736,125.78988708567545,,0,0,0,125.78988708567545
83,VAL,9.07858265041625,,0,0,0,9.07858265041625,4.48097011025086,,0,0,0,4.48097011025086,174.40378382741147,,0,0,0,174.40378382741147,61.24270870631035,,0,0,0,61.24270870631035,34.5997028974914,,0,0,0,34.5997028974914,126.69606383387169,,0,0,0,126.69606383387169
84,THR,8.581784460034411,,0,0,0,8.581784460034411,4.838665796176046,,0,0,0,4.838665796176046,173.7542497170052,,0,0,0,173.7542497170052,61.97471204079809,,0,0,0,61.97471204079809,70.2291521040737,,0,0,0,70.2291521040737,123.69236697467532,,0,0,0,123.69236697467532
85,VAL,9.159813107015205,,0,0,0,9.159813107015205,4.709664083638583,,0,0,0,4.709664083638583,174.84051355217562,,0,0,0,174.84051355217562,60.88565767289932,,0,0,0,60.88565767289932,32.521948354501056,,0,0,0,32.521948354501056,127.90442962370408,,0,0,0,127.90442962370408
86,ASP,9.083843823454323,,0,0,0,9.083843823454323,5.413148647796648,,0,0,0,5.413148647796648,177.50950548718504,,0,0,0,177.50950548718504,52.51522799963925,,0,0,0,52.51522799963925,44.687576739654794,,0,0,0,44.687576739654794,127.44792625554446,,0,0,0,127.44792625554446
87,SER,8.771578122322122,,0,0,0,8.771578122322122,4.356078398135198,,0,0,0,4.356078398135198,175.98816254034853,,0,0,0,175.98816254034853,60.617413409546,,0,0,0,60.617413409546,63.610136718470415,,0,0,0,63.610136718470415,114.30711353661894,,0,0,0,114.30711353661894
88,LYS,8.321773391674991,,0,0,0,8.321773391674991,4.348534257264957,,0,0,0,4.348534257264957,177.85888180647686,,0,0,0,177.85888180647686,57.97008330734266,,0,0,0,57.97008330734266,32.46734116237651,,0,0,0,32.46734116237651,120.78512457155622,,0,0,0,120.78512457155622
89,ASN,7.976208723359974,,0,0,0,7.976208723359974,4.84082758933289,,0,0,0,4.84082758933289,176.2116766065379,,0,0,0,176.2116766065379,53.22397225852481,,0,0,0,53.22397225852481,38.73165007132867,,0,0,0,38.73165007132867,115.2614899980353,,0,0,0,115.2614899980353