RESNUM,RESNAME,H_X,H_Y,H_BEST_REF_SCORE,H_BEST_REF_COV,H_BEST_REF_MATCH,H_UCBShift,HA_X,HA_Y,HA_BEST_REF_SCORE,HA_BEST_REF_COV,HA_BEST_REF_MATCH,HA_UCBShift,C_X,C_Y,C_BEST_REF_SCORE,C_BEST_REF_COV,C_BEST_REF_MATCH,C_UCBShift,CA_X,CA_Y,CA_BEST_REF_SCORE,CA_BEST_REF_COV,CA_BEST_REF_MATCH,CA_UCBShift,CB_X,CB_Y,CB_BEST_REF_SCORE,CB_BEST_REF_COV,CB_BEST_REF_MATCH,CB_UCBShift,N_X,N_Y,N_BEST_REF_SCORE,N_BEST_REF_COV,N_BEST_REF_MATCH,N_UCBShift
1,MET,8.3819859506438,,0,0,0,8.3819859506438,4.342609423210123,,0,0,0,4.342609423210123,175.36879398444336,,0,0,0,175.36879398444336,55.22756746608946,,0,0,0,55.22756746608946,32.193274331668334,,0,0,0,32.193274331668334,121.2668946084804,,0,0,0,121.2668946084804
2,GLY,8.397870596470197,,0,0,0,8.397870596470197,3.9440380179292926,,0,0,0,3.9440380179292926,173.8162037972916,,0,0,0,173.8162037972916,45.08866261767677,,0,0,0,45.08866261767677,,,0,0,0,,111.34093781674437,,0,0,0,111.34093781674437
3,HIS,8.467198322044622,,0,0,0,8.467198322044622,4.417054758830059,,0,0,0,4.417054758830059,174.65612871257076,,0,0,0,174.65612871257076,56.1337110018426,,0,0,0,56.1337110018426,29.244096872832724,,0,0,0,29.244096872832724,119.75234878727385,,0,0,0,119.75234878727385
4,HIS,8.465046179392829,,0,0,0,8.465046179392829,4.409845337867687,,0,0,0,4.409845337867687,175.0844582005328,,0,0,0,175.0844582005328,56.38866951350316,,0,0,0,56.38866951350316,29.068589925296926,,0,0,0,29.068589925296926,121.26035385900767,,0,0,0,121.26035385900767
5,HIS,8.519665611743811,,0,0,0,8.519665611743811,4.351097154556554,,0,0,0,4.351097154556554,174.79598326703297,,0,0,0,174.79598326703297,56.303918937756684,,0,0,0,56.303918937756684,29.35269941116661,,0,0,0,29.35269941116661,121.18180334806306,,0,0,0,121.18180334806306
6,HIS,8.594972285975135,,0,0,0,8.594972285975135,4.3537034957431455,,0,0,0,4.3537034957431455,175.13853464667,,0,0,0,175.13853464667,56.41816563309468,,0,0,0,56.41816563309468,28.804171499001,,0,0,0,28.804171499001,121.59662155204241,,0,0,0,121.59662155204241
7,HIS,8.401501755827505,,0,0,0,8.401501755827505,4.366190705655455,,0,0,0,4.366190705655455,175.1284032730991,,0,0,0,175.1284032730991,56.43503651206571,,0,0,0,56.43503651206571,28.702872434304584,,0,0,0,28.702872434304584,121.95694188368299,,0,0,0,121.95694188368299
8,HIS,8.392497845676546,,0,0,0,8.392497845676546,4.399436696403597,,0,0,0,4.399436696403597,174.8306457150849,,0,0,0,174.8306457150849,55.84042911228771,,0,0,0,55.84042911228771,28.564037466733268,,0,0,0,28.564037466733268,121.33675981156067,,0,0,0,121.33675981156067
9,SER,8.187613212387612,,0,0,0,8.187613212387612,4.50374586049506,,0,0,0,4.50374586049506,174.1310040967366,,0,0,0,174.1310040967366,58.32513060643245,,0,0,0,58.32513060643245,62.81190917379287,,0,0,0,62.81190917379287,117.58054432856588,,0,0,0,117.58054432856588
10,HIS,8.228938012465312,,0,0,0,8.228938012465312,4.349003267443668,,0,0,0,4.349003267443668,174.4741126174936,,0,0,0,174.4741126174936,56.68304662099012,,0,0,0,56.68304662099012,29.07577740204795,,0,0,0,29.07577740204795,121.71936040486182,,0,0,0,121.71936040486182
11,MET,8.085069684493284,,0,0,0,8.085069684493284,4.536093612676213,,0,0,0,4.536093612676213,175.6973238084804,,0,0,0,175.6973238084804,55.18168648941059,,0,0,0,55.18168648941059,32.92878560627705,,0,0,0,32.92878560627705,122.03968731431901,,0,0,0,122.03968731431901
12,LYS,8.42364476967477,,0,0,0,8.42364476967477,4.168576759151959,,0,0,0,4.168576759151959,177.40006651168275,,0,0,0,177.40006651168275,57.44628727873238,,0,0,0,57.44628727873238,32.44287087290488,,0,0,0,32.44287087290488,122.62146392065712,,0,0,0,122.62146392065712
13,ARG,8.39995310016095,,0,0,0,8.39995310016095,4.3331813296287045,,0,0,0,4.3331813296287045,175.9045108430181,,0,0,0,175.9045108430181,56.54117443406593,,0,0,0,56.54117443406593,30.33127428852814,,0,0,0,30.33127428852814,120.5457164442058,,0,0,0,120.5457164442058
14,SER,8.006811497968698,,0,0,0,8.006811497968698,4.574991772360972,,0,0,0,4.574991772360972,173.19201231436895,,0,0,0,173.19201231436895,58.24011969366744,,0,0,0,58.24011969366744,64.0867428959818,,0,0,0,64.0867428959818,115.5826996971806,,0,0,0,115.5826996971806
15,GLY,8.07140172015762,,0,0,0,8.07140172015762,3.509871956537906,,0,0,0,3.509871956537906,173.02916886443,,0,0,0,173.02916886443,44.24207022033522,,0,0,0,44.24207022033522,,,0,0,0,,110.27685579443889,,0,0,0,110.27685579443889
16,ARG,8.709560426695527,,0,0,0,8.709560426695527,4.626675634659785,,0,0,0,4.626675634659785,174.9761957269009,,0,0,0,174.9761957269009,55.24398282525807,,0,0,0,55.24398282525807,31.6765018489122,,0,0,0,31.6765018489122,123.80909055614386,,0,0,0,123.80909055614386
17,GLU,8.565822327039626,,0,0,0,8.565822327039626,4.076500297627372,,0,0,0,4.076500297627372,175.85931141714397,,0,0,0,175.85931141714397,56.78849714879565,,0,0,0,56.78849714879565,29.585100868931068,,0,0,0,29.585100868931068,127.89967678587523,,0,0,0,127.89967678587523
18,ILE,8.497169346470196,,0,0,0,8.497169346470196,4.64126068506771,,0,0,0,4.64126068506771,175.2144845001998,,0,0,0,175.2144845001998,59.274817859529364,,0,0,0,59.274817859529364,41.5437290536186,,0,0,0,41.5437290536186,121.56807293258409,,0,0,0,121.56807293258409
19,THR,8.15260631829837,,0,0,0,8.15260631829837,4.608306266206016,,0,0,0,4.608306266206016,175.723048756438,,0,0,0,175.723048756438,60.466176267249416,,0,0,0,60.466176267249416,71.08838619494395,,0,0,0,71.08838619494395,111.27168832178377,,0,0,0,111.27168832178377
20,TRP,9.034645123088023,,0,0,0,9.034645123088023,3.9540120723942724,,0,0,0,3.9540120723942724,176.79108912012987,,0,0,0,176.79108912012987,60.675370132950384,,0,0,0,60.675370132950384,29.486785352497503,,0,0,0,29.486785352497503,123.79356934591519,,0,0,0,123.79356934591519
21,LYS,8.46316310099345,,0,0,0,8.46316310099345,3.82645833997669,,0,0,0,3.82645833997669,178.707240500444,,0,0,0,178.707240500444,59.646401071090025,,0,0,0,59.646401071090025,31.835028405888558,,0,0,0,31.835028405888558,117.36737020755356,,0,0,0,117.36737020755356
22,ASP,8.02258717946498,,0,0,0,8.02258717946498,4.3795358716838715,,0,0,0,4.3795358716838715,177.99576020689867,,0,0,0,177.99576020689867,57.16813035652126,,0,0,0,57.16813035652126,41.634799191008995,,0,0,0,41.634799191008995,121.39239580469531,,0,0,0,121.39239580469531
23,PHE,8.590614662881563,,0,0,0,8.590614662881563,4.198033535989011,,0,0,0,4.198033535989011,176.9998284845377,,0,0,0,176.9998284845377,61.458946394871795,,0,0,0,61.458946394871795,39.240178253063604,,0,0,0,39.240178253063604,121.19915737858253,,0,0,0,121.19915737858253
24,VAL,8.520517517876566,,0,0,0,8.520517517876566,2.8731520944805196,,0,0,0,2.8731520944805196,178.45341468180155,,0,0,0,178.45341468180155,66.43150759296259,,0,0,0,66.43150759296259,31.658655486668884,,0,0,0,31.658655486668884,119.77058948587523,,0,0,0,119.77058948587523
25,ASN,8.21695747025197,,0,0,0,8.21695747025197,4.336243193994894,,0,0,0,4.336243193994894,177.00373449169163,,0,0,0,177.00373449169163,55.70871776049506,,0,0,0,55.70871776049506,38.400186566167164,,0,0,0,38.400186566167164,118.30660048931624,,0,0,0,118.30660048931624
26,ASN,8.180413449067599,,0,0,0,8.180413449067599,4.44138336912532,,0,0,0,4.44138336912532,175.67123103112442,,0,0,0,175.67123103112442,54.15684149830725,,0,0,0,54.15684149830725,39.3020383019536,,0,0,0,39.3020383019536,114.76032684481075,,0,0,0,114.76032684481075
27,TYR,7.2324400805416795,,0,0,0,7.2324400805416795,4.719095852408703,,0,0,0,4.719095852408703,176.8932436148629,,0,0,0,176.8932436148629,58.991131202164496,,0,0,0,58.991131202164496,38.98726827089022,,0,0,0,38.98726827089022,117.21904584637585,,0,0,0,117.21904584637585
28,LEU,8.258797970812521,,0,0,0,8.258797970812521,3.9093941265318017,,0,0,0,3.9093941265318017,178.58327392049617,,0,0,0,178.58327392049617,58.16371923178488,,0,0,0,58.16371923178488,41.57833661762682,,0,0,0,41.57833661762682,121.42013772284382,,0,0,0,121.42013772284382
29,SER,8.255507011016762,,0,0,0,8.255507011016762,4.171464760264735,,0,0,0,4.171464760264735,175.5197987896437,,0,0,0,175.5197987896437,60.59081240160395,,0,0,0,60.59081240160395,62.65227272793317,,0,0,0,62.65227272793317,113.87339704323455,,0,0,0,113.87339704323455
30,LYS,7.51851294046509,,0,0,0,7.51851294046509,4.352726842590743,,0,0,0,4.352726842590743,177.5235520413753,,0,0,0,177.5235520413753,55.92843241974692,,0,0,0,55.92843241974692,32.712627344838495,,0,0,0,32.712627344838495,119.9407650451937,,0,0,0,119.9407650451937
31,GLY,7.934113148606949,,0,0,0,7.934113148606949,3.9824807344877344,,0,0,0,3.9824807344877344,175.97099131234322,,0,0,0,175.97099131234322,46.34387962863803,,0,0,0,46.34387962863803,,,0,0,0,,109.08796102008547,,0,0,0,109.08796102008547
32,VAL,7.728249833494282,,0,0,0,7.728249833494282,4.5051990938561435,,0,0,0,4.5051990938561435,175.4920499271118,,0,0,0,175.4920499271118,61.938072115012766,,0,0,0,61.938072115012766,32.669055807958706,,0,0,0,32.669055807958706,113.96159402630703,,0,0,0,113.96159402630703
33,VAL,7.643264420351869,,0,0,0,7.643264420351869,4.19043020524198,,0,0,0,4.19043020524198,175.21183705637142,,0,0,0,175.21183705637142,62.56468396776002,,0,0,0,62.56468396776002,32.85792087384837,,0,0,0,32.85792087384837,122.08649518075258,,0,0,0,122.08649518075258
34,ASP,8.915385735780886,,0,0,0,8.915385735780886,4.888182567193917,,0,0,0,4.888182567193917,175.9711231446498,,0,0,0,175.9711231446498,55.53256818339438,,0,0,0,55.53256818339438,43.364970971500725,,0,0,0,43.364970971500725,128.8417734374126,,0,0,0,128.8417734374126
35,ARG,7.808710183227884,,0,0,0,7.808710183227884,5.068480256815407,,0,0,0,5.068480256815407,173.361790928355,,0,0,0,173.361790928355,55.32804059051504,,0,0,0,55.32804059051504,33.1507624975136,,0,0,0,33.1507624975136,113.69019862466422,,0,0,0,113.69019862466422
36,LEU,8.944724691758243,,0,0,0,8.944724691758243,5.059959073476524,,0,0,0,5.059959073476524,175.61984584825728,,0,0,0,175.61984584825728,53.30550992502498,,0,0,0,53.30550992502498,44.120680782978134,,0,0,0,44.120680782978134,120.70577521998001,,0,0,0,120.70577521998001
37,GLU,9.045412168065267,,0,0,0,9.045412168065267,4.957010576035076,,0,0,0,4.957010576035076,175.25418000317458,,0,0,0,175.25418000317458,54.5200646526196,,0,0,0,54.5200646526196,31.516051684293483,,0,0,0,31.516051684293483,122.89959539361195,,0,0,0,122.89959539361195
38,VAL,8.944107944366744,,0,0,0,8.944107944366744,4.262912527777777,,0,0,0,4.262912527777777,174.80996855265846,,0,0,0,174.80996855265846,62.29293220947386,,0,0,0,62.29293220947386,31.514284962470864,,0,0,0,31.514284962470864,126.05292102448108,,0,0,0,126.05292102448108
39,VAL,8.771841046764347,,0,0,0,8.771841046764347,4.495182257387057,,0,0,0,4.495182257387057,176.3956387890998,,0,0,0,176.3956387890998,60.6199827951604,,0,0,0,60.6199827951604,31.98681492949828,,0,0,0,31.98681492949828,129.3282476372128,,0,0,0,129.3282476372128
40,ASN,9.287511923676323,,0,0,0,9.287511923676323,4.376049780710956,,0,0,0,4.376049780710956,174.7357798029415,,0,0,0,174.7357798029415,54.48614703428238,,0,0,0,54.48614703428238,36.936476235847486,,0,0,0,36.936476235847486,127.12877727375957,,0,0,0,127.12877727375957
41,LYS,8.231024288722388,,0,0,0,8.231024288722388,3.9113121596015095,,0,0,0,3.9113121596015095,176.70598235592186,,0,0,0,176.70598235592186,57.974060924758575,,0,0,0,57.974060924758575,31.208854721889224,,0,0,0,31.208854721889224,111.88308411359198,,0,0,0,111.88308411359198
42,ARG,8.055792774902875,,0,0,0,8.055792774902875,4.526142285975136,,0,0,0,4.526142285975136,175.29628236784328,,0,0,0,175.29628236784328,57.275607426085024,,0,0,0,57.275607426085024,33.23848746567321,,0,0,0,33.23848746567321,116.90365207262182,,0,0,0,116.90365207262182
43,PHE,7.568625992840494,,0,0,0,7.568625992840494,5.268303047929847,,0,0,0,5.268303047929847,172.58244677615718,,0,0,0,172.58244677615718,55.98394283176823,,0,0,0,55.98394283176823,42.45295533414364,,0,0,0,42.45295533414364,114.55280280471196,,0,0,0,114.55280280471196
44,VAL,8.747714033771784,,0,0,0,8.747714033771784,4.5096934406371405,,0,0,0,4.5096934406371405,174.36561074789654,,0,0,0,174.36561074789654,60.50539471259297,,0,0,0,60.50539471259297,32.30887738275613,,0,0,0,32.30887738275613,120.87912961424686,,0,0,0,120.87912961424686
45,ARG,8.95833043955489,,0,0,0,8.95833043955489,5.108848221844821,,0,0,0,5.108848221844821,174.50639613987124,,0,0,0,174.50639613987124,55.170304138428236,,0,0,0,55.170304138428236,32.26255226115551,,0,0,0,32.26255226115551,128.4937060742535,,0,0,0,128.4937060742535
46,VAL,8.903290738317237,,0,0,0,8.903290738317237,4.104785509390609,,0,0,0,4.104785509390609,174.59518187162283,,0,0,0,174.59518187162283,62.260730391980246,,0,0,0,62.260730391980246,32.29469844265179,,0,0,0,32.29469844265179,127.68314336987457,,0,0,0,127.68314336987457
47,THR,8.76996322044067,,0,0,0,8.76996322044067,4.591927246187146,,0,0,0,4.591927246187146,173.74606954893994,,0,0,0,173.74606954893994,61.30661891736597,,0,0,0,61.30661891736597,70.48298127094017,,0,0,0,70.48298127094017,122.08271740519481,,0,0,0,122.08271740519481
48,PHE,9.070023896320347,,0,0,0,9.070023896320347,5.216103085653235,,0,0,0,5.216103085653235,177.16348413124098,,0,0,0,177.16348413124098,57.2772229023532,,0,0,0,57.2772229023532,40.74606032994783,,0,0,0,40.74606032994783,126.13915777500831,,0,0,0,126.13915777500831
49,THR,8.705744196137196,,0,0,0,8.705744196137196,4.438424703124654,,0,0,0,4.438424703124654,173.1548856219669,,0,0,0,173.1548856219669,61.118014916500165,,0,0,0,61.118014916500165,69.76148423474304,,0,0,0,69.76148423474304,118.70368044297369,,0,0,0,118.70368044297369
50,PRO,,,0,0,0,,4.317859683566434,,0,0,0,4.317859683566434,178.01123203018093,,0,0,0,178.01123203018093,64.56166499916749,,0,0,0,64.56166499916749,31.582848413281166,,0,0,0,31.582848413281166,,,0,0,0,
51,GLY,8.842490017310467,,0,0,0,8.842490017310467,3.9877619508602504,,0,0,0,3.9877619508602504,175.53528057140082,,0,0,0,175.53528057140082,45.735906788217335,,0,0,0,45.735906788217335,,,0,0,0,,113.29555080768121,,0,0,0,113.29555080768121
52,LYS,8.065790941652791,,0,0,0,8.065790941652791,4.5159169002442,,0,0,0,4.5159169002442,176.30505129903983,,0,0,0,176.30505129903983,55.816718432439785,,0,0,0,55.816718432439785,32.976015102503055,,0,0,0,32.976015102503055,119.81661566890888,,0,0,0,119.81661566890888
53,THR,7.799962490226441,,0,0,0,7.799962490226441,3.7364950175629943,,0,0,0,3.7364950175629943,173.1865679629204,,0,0,0,173.1865679629204,59.63837059989455,,0,0,0,59.63837059989455,69.60367345453434,,0,0,0,69.60367345453434,115.53977815111556,,0,0,0,115.53977815111556
54,PRO,,,0,0,0,,4.323759196964147,,0,0,0,4.323759196964147,177.4862506634088,,0,0,0,177.4862506634088,62.91251546751582,,0,0,0,62.91251546751582,32.28258018135198,,0,0,0,32.28258018135198,,,0,0,0,
55,VAL,8.235158203818402,,0,0,0,8.235158203818402,3.8315703430513923,,0,0,0,3.8315703430513923,176.23510593458764,,0,0,0,176.23510593458764,63.91721466187146,,0,0,0,63.91721466187146,31.890247587645685,,0,0,0,31.890247587645685,122.11600493038073,,0,0,0,122.11600493038073
56,ASP,8.16572400966256,,0,0,0,8.16572400966256,4.6175851023448775,,0,0,0,4.6175851023448775,176.70933046035077,,0,0,0,176.70933046035077,53.93287706548452,,0,0,0,53.93287706548452,40.30219638866689,,0,0,0,40.30219638866689,119.10190998074704,,0,0,0,119.10190998074704
57,GLY,8.10872988922189,,0,0,0,8.10872988922189,3.9394469866688873,,0,0,0,3.9394469866688873,174.0724968925186,,0,0,0,174.0724968925186,45.723511558874456,,0,0,0,45.723511558874456,,,0,0,0,,108.84103336592297,,0,0,0,108.84103336592297
58,GLN,8.194034113286714,,0,0,0,8.194034113286714,4.498275615706516,,0,0,0,4.498275615706516,175.41184830203684,,0,0,0,175.41184830203684,55.840344807675656,,0,0,0,55.840344807675656,30.23138796911422,,0,0,0,30.23138796911422,120.2875993930514,,0,0,0,120.2875993930514
59,TYR,8.324120695904096,,0,0,0,8.324120695904096,4.9002060846098345,,0,0,0,4.9002060846098345,174.47287711527918,,0,0,0,174.47287711527918,57.41813028734044,,0,0,0,57.41813028734044,39.760920356926405,,0,0,0,39.760920356926405,118.53925429654234,,0,0,0,118.53925429654234
60,VAL,8.698004994366743,,0,0,0,8.698004994366743,5.318028408363858,,0,0,0,5.318028408363858,175.08089911653903,,0,0,0,175.08089911653903,59.908759401459655,,0,0,0,59.908759401459655,34.076306351942506,,0,0,0,34.076306351942506,115.43992116325897,,0,0,0,115.43992116325897
61,TRP,8.938340379426128,,0,0,0,8.938340379426128,5.795622701320901,,0,0,0,5.795622701320901,173.60347548139637,,0,0,0,173.60347548139637,55.33414738946054,,0,0,0,55.33414738946054,32.4001443436175,,0,0,0,32.4001443436175,121.22587910788656,,0,0,0,121.22587910788656
62,PHE,9.017091655588857,,0,0,0,9.017091655588857,4.950481670107671,,0,0,0,4.950481670107671,173.26987309309024,,0,0,0,173.26987309309024,56.01532671567877,,0,0,0,56.01532671567877,41.49412076100567,,0,0,0,41.49412076100567,116.63001770936286,,0,0,0,116.63001770936286
63,ASN,9.00726258959374,,0,0,0,9.00726258959374,4.9806273745199245,,0,0,0,4.9806273745199245,175.12136489018758,,0,0,0,175.12136489018758,54.05676756300921,,0,0,0,54.05676756300921,39.11918767127317,,0,0,0,39.11918767127317,120.59233037118992,,0,0,0,120.59233037118992
64,ILE,8.578517679398379,,0,0,0,8.578517679398379,4.433500398609724,,0,0,0,4.433500398609724,176.18492309334556,,0,0,0,176.18492309334556,60.244859430036634,,0,0,0,60.244859430036634,39.965746226978574,,0,0,0,39.965746226978574,119.63407782271062,,0,0,0,119.63407782271062
65,GLY,8.827287055222556,,0,0,0,8.827287055222556,3.9369291582500834,,0,0,0,3.9369291582500834,174.02477056678876,,0,0,0,174.02477056678876,45.79529517171717,,0,0,0,45.79529517171717,,,0,0,0,,112.96126357000222,,0,0,0,112.96126357000222
66,SER,7.7647104915917415,,0,0,0,7.7647104915917415,4.648513400616051,,0,0,0,4.648513400616051,174.6195774963148,,0,0,0,174.6195774963148,57.450728999045396,,0,0,0,57.450728999045396,65.03203561028971,,0,0,0,65.03203561028971,112.25655613740703,,0,0,0,112.25655613740703
67,VAL,8.794298643728492,,0,0,0,8.794298643728492,3.7741584602619604,,0,0,0,3.7741584602619604,177.38730985129317,,0,0,0,177.38730985129317,66.33346122359862,,0,0,0,66.33346122359862,31.76613029342324,,0,0,0,31.76613029342324,122.60816311566212,,0,0,0,122.60816311566212
68,ASP,8.386588557575758,,0,0,0,8.386588557575758,4.341555676534576,,0,0,0,4.341555676534576,178.42758134446112,,0,0,0,178.42758134446112,57.449441970496174,,0,0,0,57.449441970496174,40.92828284376179,,0,0,0,40.92828284376179,119.85305242994228,,0,0,0,119.85305242994228
69,THR,8.11672283846154,,0,0,0,8.11672283846154,3.965460638475414,,0,0,0,3.965460638475414,176.5277834652181,,0,0,0,176.5277834652181,66.42661854057609,,0,0,0,66.42661854057609,68.6360467515762,,0,0,0,68.6360467515762,116.55872847882118,,0,0,0,116.55872847882118
70,PHE,8.281997020973472,,0,0,0,8.281997020973472,4.023973932292707,,0,0,0,4.023973932292707,176.54743971403042,,0,0,0,176.54743971403042,61.46995232837718,,0,0,0,61.46995232837718,38.98668818688534,,0,0,0,38.98668818688534,122.42800694870685,,0,0,0,122.42800694870685
71,GLU,8.766326946697747,,0,0,0,8.766326946697747,3.5697624460456217,,0,0,0,3.5697624460456217,178.60390477077365,,0,0,0,178.60390477077365,59.94955838953269,,0,0,0,59.94955838953269,29.501668795288044,,0,0,0,29.501668795288044,119.40861521814297,,0,0,0,119.40861521814297
72,ARG,8.19669531939727,,0,0,0,8.19669531939727,4.030951361832612,,0,0,0,4.030951361832612,178.47916263628593,,0,0,0,178.47916263628593,59.28764678236763,,0,0,0,59.28764678236763,29.884296076229326,,0,0,0,29.884296076229326,119.23762358699078,,0,0,0,119.23762358699078
73,ASN,8.048454356093906,,0,0,0,8.048454356093906,4.469810411949163,,0,0,0,4.469810411949163,177.53550545360193,,0,0,0,177.53550545360193,55.31609793250638,,0,0,0,55.31609793250638,37.90295136092241,,0,0,0,37.90295136092241,119.07281006161061,,0,0,0,119.07281006161061
74,LEU,8.466238951809302,,0,0,0,8.466238951809302,4.277375388933289,,0,0,0,4.277375388933289,178.56745034699745,,0,0,0,178.56745034699745,58.02318649824065,,0,0,0,58.02318649824065,41.5080206022644,,0,0,0,41.5080206022644,123.04623857508602,,0,0,0,123.04623857508602
75,GLU,8.717517613203462,,0,0,0,8.717517613203462,3.8820203448301696,,0,0,0,3.8820203448301696,179.28945722737816,,0,0,0,179.28945722737816,59.9902804529748,,0,0,0,59.9902804529748,29.35188140955156,,0,0,0,29.35188140955156,118.83505036324232,,0,0,0,118.83505036324232
76,THR,8.083051376812078,,0,0,0,8.083051376812078,4.0898274050005545,,0,0,0,4.0898274050005545,176.9565829108447,,0,0,0,176.9565829108447,66.74075016588411,,0,0,0,66.74075016588411,68.50627368806194,,0,0,0,68.50627368806194,116.45020271848152,,0,0,0,116.45020271848152
77,LEU,8.257313745171496,,0,0,0,8.257313745171496,4.16035175961261,,0,0,0,4.16035175961261,179.09199583867797,,0,0,0,179.09199583867797,57.7493827000888,,0,0,0,57.7493827000888,41.736892742313245,,0,0,0,41.736892742313245,122.66773580320235,,0,0,0,122.66773580320235
78,GLN,8.626829952170052,,0,0,0,8.626829952170052,3.9661567295399043,,0,0,0,3.9661567295399043,178.02619417154511,,0,0,0,178.02619417154511,59.55782762477522,,0,0,0,59.55782762477522,28.44714067253302,,0,0,0,28.44714067253302,118.78759796931956,,0,0,0,118.78759796931956
79,GLN,8.174339694893995,,0,0,0,8.174339694893995,4.107217178904429,,0,0,0,4.107217178904429,178.9407548625763,,0,0,0,178.9407548625763,58.901925645826395,,0,0,0,58.901925645826395,28.561430197191697,,0,0,0,28.561430197191697,119.6838536535964,,0,0,0,119.6838536535964
80,GLU,8.269288029453879,,0,0,0,8.269288029453879,4.075563697238872,,0,0,0,4.075563697238872,178.51858569503273,,0,0,0,178.51858569503273,59.0706659000666,,0,0,0,59.0706659000666,29.56030646215451,,0,0,0,29.56030646215451,121.77244187085137,,0,0,0,121.77244187085137
81,LEU,7.865964296509047,,0,0,0,7.865964296509047,4.331058306759907,,0,0,0,4.331058306759907,177.37749978559773,,0,0,0,177.37749978559773,54.89887074017094,,0,0,0,54.89887074017094,42.84952769067044,,0,0,0,42.84952769067044,118.0481465522533,,0,0,0,118.0481465522533
82,GLY,7.866189313902764,,0,0,0,7.866189313902764,3.955627208308357,,0,0,0,3.955627208308357,174.84927164494394,,0,0,0,174.84927164494394,46.24645464766345,,0,0,0,46.24645464766345,,,0,0,0,,108.34078252098458,,0,0,0,108.34078252098458
83,ILE,7.943934885359085,,0,0,0,7.943934885359085,4.079496957575758,,0,0,0,4.079496957575758,175.51264789346766,,0,0,0,175.51264789346766,61.60184098927184,,0,0,0,61.60184098927184,37.67375043371628,,0,0,0,37.67375043371628,121.29445945623822,,0,0,0,121.29445945623822
84,GLU,8.45365161107226,,0,0,0,8.45365161107226,4.226301184748585,,0,0,0,4.226301184748585,177.63146277029082,,0,0,0,177.63146277029082,56.52121626514042,,0,0,0,56.52121626514042,30.33508841042291,,0,0,0,30.33508841042291,128.2883924847042,,0,0,0,128.2883924847042
85,GLY,8.824903694821845,,0,0,0,8.824903694821845,3.9853364034632035,,0,0,0,3.9853364034632035,176.00881835604395,,0,0,0,176.00881835604395,47.51065956830392,,0,0,0,47.51065956830392,,,0,0,0,,110.71576490142634,,0,0,0,110.71576490142634
86,GLU,9.084885277178376,,0,0,0,9.084885277178376,4.1856847186563435,,0,0,0,4.1856847186563435,177.2394806137862,,0,0,0,177.2394806137862,58.07169302220557,,0,0,0,58.07169302220557,28.933933127339326,,0,0,0,28.933933127339326,119.47795093533134,,0,0,0,119.47795093533134
87,ASN,7.913924133361084,,0,0,0,7.913924133361084,4.784301385525586,,0,0,0,4.784301385525586,175.13404820445663,,0,0,0,175.13404820445663,52.97939893569209,,0,0,0,52.97939893569209,39.445155164108115,,0,0,0,39.445155164108115,116.46972044926186,,0,0,0,116.46972044926186
88,ARG,7.482323785753136,,0,0,0,7.482323785753136,4.267705222952047,,0,0,0,4.267705222952047,176.17904516109448,,0,0,0,176.17904516109448,56.56617096065601,,0,0,0,56.56617096065601,30.691840202586302,,0,0,0,30.691840202586302,120.60946757863803,,0,0,0,120.60946757863803
89,VAL,8.822676009834609,,0,0,0,8.822676009834609,3.947712126259852,,0,0,0,3.947712126259852,174.78454016129982,,0,0,0,174.78454016129982,61.298434423643016,,0,0,0,61.298434423643016,32.227503185997335,,0,0,0,32.227503185997335,124.55985804519369,,0,0,0,124.55985804519369