RESNUM,RESNAME,H_X,H_Y,H_BEST_REF_SCORE,H_BEST_REF_COV,H_BEST_REF_MATCH,H_UCBShift,HA_X,HA_Y,HA_BEST_REF_SCORE,HA_BEST_REF_COV,HA_BEST_REF_MATCH,HA_UCBShift,C_X,C_Y,C_BEST_REF_SCORE,C_BEST_REF_COV,C_BEST_REF_MATCH,C_UCBShift,CA_X,CA_Y,CA_BEST_REF_SCORE,CA_BEST_REF_COV,CA_BEST_REF_MATCH,CA_UCBShift,CB_X,CB_Y,CB_BEST_REF_SCORE,CB_BEST_REF_COV,CB_BEST_REF_MATCH,CB_UCBShift,N_X,N_Y,N_BEST_REF_SCORE,N_BEST_REF_COV,N_BEST_REF_MATCH,N_UCBShift
1,LYS,8.389823998179597,,0,0,0,8.389823998179597,4.308813548956599,,0,0,0,4.308813548956599,174.9169212932512,,0,0,0,174.9169212932512,56.1675428922189,,0,0,0,56.1675428922189,32.98154216143856,,0,0,0,32.98154216143856,122.16085184019315,,0,0,0,122.16085184019315
2,ILE,8.028926544766344,,0,0,0,8.028926544766344,4.271114319219669,,0,0,0,4.271114319219669,175.64022388887224,,0,0,0,175.64022388887224,60.786486131646136,,0,0,0,60.786486131646136,38.96150773681873,,0,0,0,38.96150773681873,122.99596014069265,,0,0,0,122.99596014069265
3,HIS,8.482731555960706,,0,0,0,8.482731555960706,4.586186746764347,,0,0,0,4.586186746764347,174.54556100557775,,0,0,0,174.54556100557775,56.09320291883672,,0,0,0,56.09320291883672,30.312982444183596,,0,0,0,30.312982444183596,124.6362066965812,,0,0,0,124.6362066965812
4,THR,8.29214738998779,,0,0,0,8.29214738998779,4.342493675230325,,0,0,0,4.342493675230325,173.88238350965145,,0,0,0,173.88238350965145,61.51700713064158,,0,0,0,61.51700713064158,69.72382707670663,,0,0,0,69.72382707670663,116.92103867230547,,0,0,0,116.92103867230547
5,SER,8.277255368159619,,0,0,0,8.277255368159619,4.465405740376291,,0,0,0,4.465405740376291,174.10021500909644,,0,0,0,174.10021500909644,58.23944249890665,,0,0,0,58.23944249890665,63.79390329322899,,0,0,0,63.79390329322899,119.05735121119992,,0,0,0,119.05735121119992
6,TYR,8.42666049159174,,0,0,0,8.42666049159174,4.4128483145965145,,0,0,0,4.4128483145965145,175.60251022222778,,0,0,0,175.60251022222778,57.80845711065046,,0,0,0,57.80845711065046,38.61551892474747,,0,0,0,38.61551892474747,123.21502240458985,,0,0,0,123.21502240458985
7,ASP,8.159402775269175,,0,0,0,8.159402775269175,4.706982021370297,,0,0,0,4.706982021370297,175.96011074862915,,0,0,0,175.96011074862915,54.30625828073038,,0,0,0,54.30625828073038,41.421980399811304,,0,0,0,41.421980399811304,123.27786610071041,,0,0,0,123.27786610071041
8,GLU,8.399139227228327,,0,0,0,8.399139227228327,4.2207370909257405,,0,0,0,4.2207370909257405,176.66664713050838,,0,0,0,176.66664713050838,56.81379012076257,,0,0,0,56.81379012076257,30.23787496930292,,0,0,0,30.23787496930292,121.9983601424409,,0,0,0,121.9983601424409
9,GLN,8.40533793104673,,0,0,0,8.40533793104673,4.180324313730714,,0,0,0,4.180324313730714,175.12543762028528,,0,0,0,175.12543762028528,56.251142029370634,,0,0,0,56.251142029370634,29.224930827400378,,0,0,0,29.224930827400378,120.99712477468643,,0,0,0,120.99712477468643
10,SER,8.29464484069264,,0,0,0,8.29464484069264,4.591074221239871,,0,0,0,4.591074221239871,174.06815346093904,,0,0,0,174.06815346093904,58.23596989472194,,0,0,0,58.23596989472194,64.06758083924409,,0,0,0,64.06758083924409,117.40142972031857,,0,0,0,117.40142972031857
11,SER,8.3729087981796,,0,0,0,8.3729087981796,4.409865993356643,,0,0,0,4.409865993356643,175.14299927900433,,0,0,0,175.14299927900433,58.0451658500888,,0,0,0,58.0451658500888,63.72929504671995,,0,0,0,63.72929504671995,118.5451675956044,,0,0,0,118.5451675956044
12,GLY,8.601562261910312,,0,0,0,8.601562261910312,3.892455279828505,,0,0,0,3.892455279828505,174.52660234951716,,0,0,0,174.52660234951716,45.86432401292596,,0,0,0,45.86432401292596,,,0,0,0,,111.74246980137085,,0,0,0,111.74246980137085
13,GLU,8.347877661482961,,0,0,0,8.347877661482961,4.252411148604173,,0,0,0,4.252411148604173,175.66634761751027,,0,0,0,175.66634761751027,56.457655484576534,,0,0,0,56.457655484576534,29.100372901565102,,0,0,0,29.100372901565102,122.41480236776557,,0,0,0,122.41480236776557
14,SER,8.080154646719947,,0,0,0,8.080154646719947,4.391540365739815,,0,0,0,4.391540365739815,174.893608893229,,0,0,0,174.893608893229,58.17047594282384,,0,0,0,58.17047594282384,63.55705545713175,,0,0,0,63.55705545713175,118.56695202877124,,0,0,0,118.56695202877124
15,LYS,8.330384670218669,,0,0,0,8.330384670218669,4.237670760059385,,0,0,0,4.237670760059385,176.01187891665555,,0,0,0,176.01187891665555,56.2236944966034,,0,0,0,56.2236944966034,32.74878469197469,,0,0,0,32.74878469197469,124.62315483882229,,0,0,0,124.62315483882229
16,VAL,7.969838106737706,,0,0,0,7.969838106737706,4.087921626742702,,0,0,0,4.087921626742702,176.29880345264735,,0,0,0,176.29880345264735,62.56233377399268,,0,0,0,62.56233377399268,32.638563312354314,,0,0,0,32.638563312354314,122.91791956045067,,0,0,0,122.91791956045067
17,LYS,8.395540958547008,,0,0,0,8.395540958547008,4.297188788555888,,0,0,0,4.297188788555888,176.3434390673382,,0,0,0,176.3434390673382,56.40931162894883,,0,0,0,56.40931162894883,33.08935357516373,,0,0,0,33.08935357516373,126.08264125892441,,0,0,0,126.08264125892441
18,LYS,8.36847811132201,,0,0,0,8.36847811132201,4.251412136235986,,0,0,0,4.251412136235986,176.69015804084805,,0,0,0,176.69015804084805,56.155809788961044,,0,0,0,56.155809788961044,32.68923566845932,,0,0,0,32.68923566845932,124.55706436525698,,0,0,0,124.55706436525698
19,ILE,8.27509999030969,,0,0,0,8.27509999030969,3.8767842768037517,,0,0,0,3.8767842768037517,176.4600129555944,,0,0,0,176.4600129555944,62.05803051345876,,0,0,0,62.05803051345876,38.514038554034855,,0,0,0,38.514038554034855,124.55666532433679,,0,0,0,124.55666532433679
20,GLU,8.791338891452991,,0,0,0,8.791338891452991,4.44782178972139,,0,0,0,4.44782178972139,175.83532610137638,,0,0,0,175.83532610137638,56.35782232429793,,0,0,0,56.35782232429793,30.121489252747253,,0,0,0,30.121489252747253,124.85073867903762,,0,0,0,124.85073867903762
21,PHE,7.624484622549674,,0,0,0,7.624484622549674,4.906901837418137,,0,0,0,4.906901837418137,175.31029869447775,,0,0,0,175.31029869447775,56.88198495880231,,0,0,0,56.88198495880231,40.765785492635146,,0,0,0,40.765785492635146,119.38853196558996,,0,0,0,119.38853196558996
22,SER,8.72570533892219,,0,0,0,8.72570533892219,4.490221514629814,,0,0,0,4.490221514629814,174.67960132964257,,0,0,0,174.67960132964257,59.52120163241758,,0,0,0,59.52120163241758,64.23547071970806,,0,0,0,64.23547071970806,116.35759416759352,,0,0,0,116.35759416759352
23,LYS,7.972532464735264,,0,0,0,7.972532464735264,5.263825523698524,,0,0,0,5.263825523698524,174.753487255883,,0,0,0,174.753487255883,55.30454274811855,,0,0,0,55.30454274811855,35.54131413142413,,0,0,0,35.54131413142413,121.2286124516539,,0,0,0,121.2286124516539
24,PHE,9.052211091702743,,0,0,0,9.052211091702743,5.092085989116439,,0,0,0,5.092085989116439,173.1388558893107,,0,0,0,173.1388558893107,56.09922321820402,,0,0,0,56.09922321820402,41.35648727062937,,0,0,0,41.35648727062937,122.96785385200356,,0,0,0,122.96785385200356
25,THR,8.58371907985348,,0,0,0,8.58371907985348,5.21211974900655,,0,0,0,5.21211974900655,173.90509244443334,,0,0,0,173.90509244443334,61.458967828393824,,0,0,0,61.458967828393824,71.05904164220779,,0,0,0,71.05904164220779,117.28508357673437,,0,0,0,117.28508357673437
26,VAL,8.99680883008103,,0,0,0,8.99680883008103,4.721540158308358,,0,0,0,4.721540158308358,174.82915798898878,,0,0,0,174.82915798898878,59.4624670503441,,0,0,0,59.4624670503441,35.26391257799423,,0,0,0,35.26391257799423,120.65293387830503,,0,0,0,120.65293387830503
27,LYS,8.48920392943723,,0,0,0,8.48920392943723,4.763379625496726,,0,0,0,4.763379625496726,175.62680823329447,,0,0,0,175.62680823329447,56.61565196636697,,0,0,0,56.61565196636697,33.364079152175606,,0,0,0,33.364079152175606,123.85549271707737,,0,0,0,123.85549271707737
28,ILE,8.811973664618716,,0,0,0,8.811973664618716,5.204904672039072,,0,0,0,5.204904672039072,174.10967457137863,,0,0,0,174.10967457137863,58.92901238278388,,0,0,0,58.92901238278388,41.74171430609945,,0,0,0,41.74171430609945,123.82266777757243,,0,0,0,123.82266777757243
29,LYS,9.047253472299921,,0,0,0,9.047253472299921,5.425692122538572,,0,0,0,5.425692122538572,176.02097379407257,,0,0,0,176.02097379407257,54.39905026984127,,0,0,0,54.39905026984127,35.51361280203685,,0,0,0,35.51361280203685,125.97030027164503,,0,0,0,125.97030027164503
30,ASN,9.17642616138306,,0,0,0,9.17642616138306,5.62396106911977,,0,0,0,5.62396106911977,174.2958229917305,,0,0,0,174.2958229917305,51.63537638265068,,0,0,0,51.63537638265068,43.01199201848152,,0,0,0,43.01199201848152,117.6926227372572,,0,0,0,117.6926227372572
31,LYS,8.213077695948495,,0,0,0,8.213077695948495,4.3293679315850815,,0,0,0,4.3293679315850815,176.99314707148406,,0,0,0,176.99314707148406,56.00817964926185,,0,0,0,56.00817964926185,33.059270555749805,,0,0,0,33.059270555749805,120.38340296245421,,0,0,0,120.38340296245421
32,ASP,8.684319166494616,,0,0,0,8.684319166494616,4.585452437556888,,0,0,0,4.585452437556888,177.41268624083696,,0,0,0,177.41268624083696,53.05463314130314,,0,0,0,53.05463314130314,41.29084703652459,,0,0,0,41.29084703652459,124.44504005721501,,0,0,0,124.44504005721501
33,LYS,8.347688007104006,,0,0,0,8.347688007104006,4.110308632928183,,0,0,0,4.110308632928183,177.39592548869464,,0,0,0,177.39592548869464,58.498093613258966,,0,0,0,58.498093613258966,32.029368751526256,,0,0,0,32.029368751526256,117.67012558131869,,0,0,0,117.67012558131869
34,SER,7.933621541136642,,0,0,0,7.933621541136642,4.406849207198357,,0,0,0,4.406849207198357,175.25203866619492,,0,0,0,175.25203866619492,58.088068167976466,,0,0,0,58.088068167976466,64.09867884333444,,0,0,0,64.09867884333444,113.27454147586303,,0,0,0,113.27454147586303
35,GLY,8.046999251936953,,0,0,0,8.046999251936953,3.6754183537989795,,0,0,0,3.6754183537989795,173.6474748378233,,0,0,0,173.6474748378233,45.02339031919747,,0,0,0,45.02339031919747,,,0,0,0,,110.80973764636474,,0,0,0,110.80973764636474
36,ASN,8.335074761510711,,0,0,0,8.335074761510711,4.6886589434398935,,0,0,0,4.6886589434398935,174.51819220927405,,0,0,0,174.51819220927405,52.49494207165612,,0,0,0,52.49494207165612,39.28425959261294,,0,0,0,39.28425959261294,119.98635504172495,,0,0,0,119.98635504172495
37,TRP,8.538512983855034,,0,0,0,8.538512983855034,5.012545875013875,,0,0,0,5.012545875013875,176.6142749075924,,0,0,0,176.6142749075924,57.13456466273171,,0,0,0,57.13456466273171,29.78933921873127,,0,0,0,29.78933921873127,122.73292643903318,,0,0,0,122.73292643903318
38,THR,9.126862631157731,,0,0,0,9.126862631157731,4.71986361072261,,0,0,0,4.71986361072261,173.41172615784214,,0,0,0,173.41172615784214,60.352558307287154,,0,0,0,60.352558307287154,71.16726620638251,,0,0,0,71.16726620638251,115.89499803941614,,0,0,0,115.89499803941614
39,ASP,8.888736767571316,,0,0,0,8.888736767571316,4.568431920693196,,0,0,0,4.568431920693196,175.48820053147963,,0,0,0,175.48820053147963,55.35170236988012,,0,0,0,55.35170236988012,40.73384387862138,,0,0,0,40.73384387862138,124.71053151890332,,0,0,0,124.71053151890332
40,LEU,8.782210275879676,,0,0,0,8.782210275879676,4.562269214169165,,0,0,0,4.562269214169165,175.69302496062826,,0,0,0,175.69302496062826,55.18754650087135,,0,0,0,55.18754650087135,43.77355202024642,,0,0,0,43.77355202024642,127.53247327007992,,0,0,0,127.53247327007992
41,GLY,7.999082163092464,,0,0,0,7.999082163092464,4.080646692804418,,0,0,0,4.080646692804418,171.89498036973026,,0,0,0,171.89498036973026,44.73060229930625,,0,0,0,44.73060229930625,,,0,0,0,,105.49211521280941,,0,0,0,105.49211521280941
42,ASP,8.667093977322677,,0,0,0,8.667093977322677,5.426471192152292,,0,0,0,5.426471192152292,174.27853768942725,,0,0,0,174.27853768942725,53.35776707852703,,0,0,0,53.35776707852703,43.472988184476634,,0,0,0,43.472988184476634,123.81716699616496,,0,0,0,123.81716699616496
43,LEU,9.074941741802643,,0,0,0,9.074941741802643,4.722283621661672,,0,0,0,4.722283621661672,174.71455939082583,,0,0,0,174.71455939082583,53.62671685836386,,0,0,0,53.62671685836386,43.684512403135756,,0,0,0,43.684512403135756,126.78576078029194,,0,0,0,126.78576078029194
44,VAL,9.202694684015983,,0,0,0,9.202694684015983,4.526307463891664,,0,0,0,4.526307463891664,175.11516420484517,,0,0,0,175.11516420484517,61.352068182228884,,0,0,0,61.352068182228884,32.628431183433236,,0,0,0,32.628431183433236,127.72976315725941,,0,0,0,127.72976315725941
45,VAL,8.916116725901874,,0,0,0,8.916116725901874,4.214101626884227,,0,0,0,4.214101626884227,173.84642042077922,,0,0,0,173.84642042077922,61.395226337012986,,0,0,0,61.395226337012986,32.41976038887224,,0,0,0,32.41976038887224,126.78502330176491,,0,0,0,126.78502330176491
46,ARG,8.883285600155402,,0,0,0,8.883285600155402,5.299887147924299,,0,0,0,5.299887147924299,174.83562816829837,,0,0,0,174.83562816829837,54.185445838267285,,0,0,0,54.185445838267285,33.37411318696304,,0,0,0,33.37411318696304,127.48906588857253,,0,0,0,127.48906588857253
47,LYS,8.978705840392939,,0,0,0,8.978705840392939,4.433674709473859,,0,0,0,4.433674709473859,175.8123005451493,,0,0,0,175.8123005451493,56.608016761949166,,0,0,0,56.608016761949166,33.045943543784,,0,0,0,33.045943543784,128.04800590409036,,0,0,0,128.04800590409036
48,GLU,8.8971571515429,,0,0,0,8.8971571515429,4.5355810238039735,,0,0,0,4.5355810238039735,177.37986726842047,,0,0,0,177.37986726842047,54.815540887135086,,0,0,0,54.815540887135086,31.618615164235763,,0,0,0,31.618615164235763,127.31595962447552,,0,0,0,127.31595962447552
49,GLU,8.923361786663337,,0,0,0,8.923361786663337,4.002888791799866,,0,0,0,4.002888791799866,176.5728186385448,,0,0,0,176.5728186385448,58.983262750876904,,0,0,0,58.983262750876904,29.35380959065934,,0,0,0,29.35380959065934,120.88408501117772,,0,0,0,120.88408501117772
50,ASN,8.375600153257853,,0,0,0,8.375600153257853,4.869729466405817,,0,0,0,4.869729466405817,174.68674171308135,,0,0,0,174.68674171308135,53.30926844391164,,0,0,0,53.30926844391164,38.31849935479521,,0,0,0,38.31849935479521,114.17985471238207,,0,0,0,114.17985471238207
51,GLY,7.8512020209013205,,0,0,0,7.8512020209013205,4.223606134476634,,0,0,0,4.223606134476634,172.63276531701632,,0,0,0,172.63276531701632,45.26122975463426,,0,0,0,45.26122975463426,,,0,0,0,,109.09807266410256,,0,0,0,109.09807266410256
52,ILE,8.710443898634699,,0,0,0,8.710443898634699,4.935006873859474,,0,0,0,4.935006873859474,174.3904002081918,,0,0,0,174.3904002081918,59.75610152294927,,0,0,0,59.75610152294927,42.234005080991224,,0,0,0,42.234005080991224,122.48243747216672,,0,0,0,122.48243747216672
53,ASP,8.875593178793428,,0,0,0,8.875593178793428,5.184059257470307,,0,0,0,5.184059257470307,175.0841859144078,,0,0,0,175.0841859144078,53.27452452465867,,0,0,0,53.27452452465867,43.55024346042846,,0,0,0,43.55024346042846,126.75043184864025,,0,0,0,126.75043184864025
54,THR,8.674926594555446,,0,0,0,8.674926594555446,5.306721938322787,,0,0,0,5.306721938322787,173.95418457205017,,0,0,0,173.95418457205017,59.20725824539904,,0,0,0,59.20725824539904,71.14019099017649,,0,0,0,71.14019099017649,114.253130914874,,0,0,0,114.253130914874
55,GLY,8.975314195088245,,0,0,0,8.975314195088245,4.102780335755911,,0,0,0,4.102780335755911,171.93129351868131,,0,0,0,171.93129351868131,44.184143858103006,,0,0,0,44.184143858103006,,,0,0,0,,112.03975854483294,,0,0,0,112.03975854483294
56,LEU,8.862806366200466,,0,0,0,8.862806366200466,4.746537054323455,,0,0,0,4.746537054323455,174.6309833557609,,0,0,0,174.6309833557609,53.38566360847486,,0,0,0,53.38566360847486,44.41135623586413,,0,0,0,44.41135623586413,125.35808038680209,,0,0,0,125.35808038680209
57,ASN,8.939155154600956,,0,0,0,8.939155154600956,5.378631843034743,,0,0,0,5.378631843034743,173.98816658764568,,0,0,0,173.98816658764568,51.65830393610279,,0,0,0,51.65830393610279,39.22883878553113,,0,0,0,39.22883878553113,126.06802238173492,,0,0,0,126.06802238173492
58,ALA,8.883630114191364,,0,0,0,8.883630114191364,5.030411874797426,,0,0,0,5.030411874797426,176.96773574665892,,0,0,0,176.96773574665892,51.6344478963703,,0,0,0,51.6344478963703,21.481025462925963,,0,0,0,21.481025462925963,127.72122609801309,,0,0,0,127.72122609801309
59,GLY,9.271004246642248,,0,0,0,9.271004246642248,3.9533812952020204,,0,0,0,3.9533812952020204,175.3068945327839,,0,0,0,175.3068945327839,46.886568258386056,,0,0,0,46.886568258386056,,,0,0,0,,109.55395646096126,,0,0,0,109.55395646096126
60,GLY,8.569139207742257,,0,0,0,8.569139207742257,3.812100409165834,,0,0,0,3.812100409165834,173.61917811572317,,0,0,0,173.61917811572317,45.257639708469306,,0,0,0,45.257639708469306,,,0,0,0,,107.86594764435009,,0,0,0,107.86594764435009
61,HIS,7.984443655611055,,0,0,0,7.984443655611055,4.937581991508491,,0,0,0,4.937581991508491,173.73591350262515,,0,0,0,173.73591350262515,54.801356387512485,,0,0,0,54.801356387512485,32.05574940222555,,0,0,0,32.05574940222555,119.24692982952602,,0,0,0,119.24692982952602
62,SER,8.63456786926407,,0,0,0,8.63456786926407,5.47461578963259,,0,0,0,5.47461578963259,173.63386310679874,,0,0,0,173.63386310679874,57.23173139693084,,0,0,0,57.23173139693084,64.36649164723609,,0,0,0,64.36649164723609,118.10110300830281,,0,0,0,118.10110300830281
63,ALA,8.925806598296148,,0,0,0,8.925806598296148,4.751419851814852,,0,0,0,4.751419851814852,175.94687983959375,,0,0,0,175.94687983959375,50.95968163638584,,0,0,0,50.95968163638584,22.653238716233766,,0,0,0,22.653238716233766,127.2277659567932,,0,0,0,127.2277659567932
64,THR,8.337427514035964,,0,0,0,8.337427514035964,4.539771866905316,,0,0,0,4.539771866905316,173.80866500253634,,0,0,0,173.80866500253634,63.39941852817183,,0,0,0,63.39941852817183,69.44548747080142,,0,0,0,69.44548747080142,117.12157640658785,,0,0,0,117.12157640658785
65,PHE,9.069882704939506,,0,0,0,9.069882704939506,5.099384436563437,,0,0,0,5.099384436563437,174.13987185292487,,0,0,0,174.13987185292487,59.03444435733156,,0,0,0,59.03444435733156,41.51975434837385,,0,0,0,41.51975434837385,127.51357028872238,,0,0,0,127.51357028872238
66,PHE,8.428370175846377,,0,0,0,8.428370175846377,5.451443987223888,,0,0,0,5.451443987223888,173.48998125160952,,0,0,0,173.48998125160952,55.7739079911311,,0,0,0,55.7739079911311,41.656776905061605,,0,0,0,41.656776905061605,112.44213097651792,,0,0,0,112.44213097651792
67,SER,9.322978425641026,,0,0,0,9.322978425641026,5.523665814552114,,0,0,0,5.523665814552114,173.4651958841825,,0,0,0,173.4651958841825,55.98387941915862,,0,0,0,55.98387941915862,66.51692929367299,,0,0,0,66.51692929367299,115.64250358792874,,0,0,0,115.64250358792874
68,LEU,9.06121886981907,,0,0,0,9.06121886981907,4.8880767261460765,,0,0,0,4.8880767261460765,176.31154081252635,,0,0,0,176.31154081252635,53.56021681860917,,0,0,0,53.56021681860917,46.01554982600178,,0,0,0,46.01554982600178,121.37039722430347,,0,0,0,121.37039722430347
69,GLU,9.129604813653014,,0,0,0,9.129604813653014,4.743682115700965,,0,0,0,4.743682115700965,177.60667616601177,,0,0,0,177.60667616601177,56.303449636219334,,0,0,0,56.303449636219334,30.894679710051058,,0,0,0,30.894679710051058,120.9760395518759,,0,0,0,120.9760395518759
70,GLU,8.634254534903985,,0,0,0,8.634254534903985,3.8654906340215343,,0,0,0,3.8654906340215343,177.8192825074592,,0,0,0,177.8192825074592,60.77099761429126,,0,0,0,60.77099761429126,29.476775760417357,,0,0,0,29.476775760417357,123.49755387209457,,0,0,0,123.49755387209457
71,GLU,9.326698946026196,,0,0,0,9.326698946026196,4.162440431718282,,0,0,0,4.162440431718282,177.78341332769452,,0,0,0,177.78341332769452,59.042712525740924,,0,0,0,59.042712525740924,29.386729282484183,,0,0,0,29.386729282484183,117.46408986610057,,0,0,0,117.46408986610057
72,VAL,7.62981060047175,,0,0,0,7.62981060047175,4.060986222763347,,0,0,0,4.060986222763347,177.48851741770451,,0,0,0,177.48851741770451,63.05202554709735,,0,0,0,63.05202554709735,32.00416689602065,,0,0,0,32.00416689602065,117.37705935960152,,0,0,0,117.37705935960152
73,VAL,7.899639307564657,,0,0,0,7.899639307564657,3.566679331926407,,0,0,0,3.566679331926407,177.27568232725054,,0,0,0,177.27568232725054,67.39169373391053,,0,0,0,67.39169373391053,31.34346311981907,,0,0,0,31.34346311981907,121.79908663644134,,0,0,0,121.79908663644134
74,ASN,8.932181117249417,,0,0,0,8.932181117249417,4.398109611025086,,0,0,0,4.398109611025086,177.86423758077478,,0,0,0,177.86423758077478,56.501341917649015,,0,0,0,56.501341917649015,37.23987049346209,,0,0,0,37.23987049346209,116.95547154435565,,0,0,0,116.95547154435565
75,ASN,8.018342655755356,,0,0,0,8.018342655755356,4.513412567232767,,0,0,0,4.513412567232767,177.03057755269174,,0,0,0,177.03057755269174,56.171225696836494,,0,0,0,56.171225696836494,39.11864886194916,,0,0,0,39.11864886194916,119.2775396559052,,0,0,0,119.2775396559052
76,PHE,8.707992874708625,,0,0,0,8.707992874708625,3.793359108205683,,0,0,0,3.793359108205683,177.05780845759796,,0,0,0,177.05780845759796,61.48200010999556,,0,0,0,61.48200010999556,38.832107900222,,0,0,0,38.832107900222,121.11799019709734,,0,0,0,121.11799019709734
77,VAL,8.597629196320346,,0,0,0,8.597629196320346,3.167488648715174,,0,0,0,3.167488648715174,178.2491827462593,,0,0,0,178.2491827462593,66.8505288092352,,0,0,0,66.8505288092352,31.541122934826284,,0,0,0,31.541122934826284,118.88274798658564,,0,0,0,118.88274798658564
78,LYS,7.770544884487734,,0,0,0,7.770544884487734,4.002386754745254,,0,0,0,4.002386754745254,178.61512423290043,,0,0,0,178.61512423290043,59.70059588323343,,0,0,0,59.70059588323343,32.37776674202464,,0,0,0,32.37776674202464,122.09137091686092,,0,0,0,122.09137091686092
79,VAL,8.17586410955156,,0,0,0,8.17586410955156,3.9185047187173936,,0,0,0,3.9185047187173936,178.84086281290377,,0,0,0,178.84086281290377,65.21930980945722,,0,0,0,65.21930980945722,31.884444024864024,,0,0,0,31.884444024864024,120.26726393569764,,0,0,0,120.26726393569764
80,MET,8.38391353144078,,0,0,0,8.38391353144078,4.2036886998168495,,0,0,0,4.2036886998168495,177.5177088993229,,0,0,0,177.5177088993229,56.54549003054168,,0,0,0,56.54549003054168,30.988636181585083,,0,0,0,30.988636181585083,116.92726308145743,,0,0,0,116.92726308145743
81,THR,7.621291880985681,,0,0,0,7.621291880985681,4.218607271939172,,0,0,0,4.218607271939172,176.15702586911976,,0,0,0,176.15702586911976,63.79066256022866,,0,0,0,63.79066256022866,69.83346292141746,,0,0,0,69.83346292141746,107.86022748038627,,0,0,0,107.86022748038627
82,GLU,8.324596246553446,,0,0,0,8.324596246553446,4.364098991108891,,0,0,0,4.364098991108891,177.5412460593018,,0,0,0,177.5412460593018,56.81367987362638,,0,0,0,56.81367987362638,32.169131758818956,,0,0,0,32.169131758818956,119.83128102899877,,0,0,0,119.83128102899877
83,GLY,8.129885578044178,,0,0,0,8.129885578044178,4.1286494936868685,,0,0,0,4.1286494936868685,173.56167626270397,,0,0,0,173.56167626270397,44.70974076620602,,0,0,0,44.70974076620602,,,0,0,0,,109.28437898427683,,0,0,0,109.28437898427683
84,GLY,8.477764768037519,,0,0,0,8.477764768037519,4.228993713084138,,0,0,0,4.228993713084138,172.36304996958043,,0,0,0,172.36304996958043,44.582470736580085,,0,0,0,44.582470736580085,,,0,0,0,,107.26528474411144,,0,0,0,107.26528474411144
85,SER,8.31520339922855,,0,0,0,8.31520339922855,5.391514600055501,,0,0,0,5.391514600055501,173.45201179630925,,0,0,0,173.45201179630925,57.21379464363969,,0,0,0,57.21379464363969,66.06174722582972,,0,0,0,66.06174722582972,116.10280585463425,,0,0,0,116.10280585463425
86,PHE,8.604523752980354,,0,0,0,8.604523752980354,5.072927769752471,,0,0,0,5.072927769752471,172.86244490735376,,0,0,0,172.86244490735376,55.97386502471418,,0,0,0,55.97386502471418,41.4389342980797,,0,0,0,41.4389342980797,117.27853019400044,,0,0,0,117.27853019400044
87,LYS,8.7990632493784,,0,0,0,8.7990632493784,4.942038136424687,,0,0,0,4.942038136424687,177.25369554105893,,0,0,0,177.25369554105893,54.56779521552337,,0,0,0,54.56779521552337,34.470034070801425,,0,0,0,34.470034070801425,121.37639546480187,,0,0,0,121.37639546480187
88,THR,8.88686738827839,,0,0,0,8.88686738827839,4.787575993967144,,0,0,0,4.787575993967144,175.02069597331555,,0,0,0,175.02069597331555,61.13241994482739,,0,0,0,61.13241994482739,70.3192017018093,,0,0,0,70.3192017018093,116.92122220974025,,0,0,0,116.92122220974025