RESNUM,RESNAME,H_X,H_Y,H_BEST_REF_SCORE,H_BEST_REF_COV,H_BEST_REF_MATCH,H_UCBShift,HA_X,HA_Y,HA_BEST_REF_SCORE,HA_BEST_REF_COV,HA_BEST_REF_MATCH,HA_UCBShift,C_X,C_Y,C_BEST_REF_SCORE,C_BEST_REF_COV,C_BEST_REF_MATCH,C_UCBShift,CA_X,CA_Y,CA_BEST_REF_SCORE,CA_BEST_REF_COV,CA_BEST_REF_MATCH,CA_UCBShift,CB_X,CB_Y,CB_BEST_REF_SCORE,CB_BEST_REF_COV,CB_BEST_REF_MATCH,CB_UCBShift,N_X,N_Y,N_BEST_REF_SCORE,N_BEST_REF_COV,N_BEST_REF_MATCH,N_UCBShift
1,MET,8.31454438051393,,0,0,0,8.31454438051393,4.42423186985792,,0,0,0,4.42423186985792,175.50632248048063,,0,0,0,175.50632248048063,55.32223605750361,,0,0,0,55.32223605750361,32.73458920830281,,0,0,0,32.73458920830281,121.01092355077144,,0,0,0,121.01092355077144
2,GLY,8.37785780027195,,0,0,0,8.37785780027195,3.8089380666555677,,0,0,0,3.8089380666555677,173.88985005779776,,0,0,0,173.88985005779776,44.88334350353536,,0,0,0,44.88334350353536,,,0,0,0,,110.64644993661338,,0,0,0,110.64644993661338
3,HIS,8.37814055022755,,0,0,0,8.37814055022755,4.381409581807082,,0,0,0,4.381409581807082,174.08810801565656,,0,0,0,174.08810801565656,55.91730517572982,,0,0,0,55.91730517572982,29.14926955883006,,0,0,0,29.14926955883006,116.7040577419525,,0,0,0,116.7040577419525
4,HIS,8.445660383244533,,0,0,0,8.445660383244533,4.501263084709735,,0,0,0,4.501263084709735,174.2123927967366,,0,0,0,174.2123927967366,55.5997471464369,,0,0,0,55.5997471464369,30.01827252931513,,0,0,0,30.01827252931513,119.84946124764124,,0,0,0,119.84946124764124
5,HIS,8.509312672427573,,0,0,0,8.509312672427573,4.4683630793983795,,0,0,0,4.4683630793983795,174.57471449787434,,0,0,0,174.57471449787434,56.04409817246642,,0,0,0,56.04409817246642,29.28165689136419,,0,0,0,29.28165689136419,120.7547334059607,,0,0,0,120.7547334059607
6,HIS,8.47264192998113,,0,0,0,8.47264192998113,4.43602371958042,,0,0,0,4.43602371958042,174.51100512220557,,0,0,0,174.51100512220557,55.39148288243423,,0,0,0,55.39148288243423,29.35598262962038,,0,0,0,29.35598262962038,121.41965619062604,,0,0,0,121.41965619062604
7,HIS,8.475967998124098,,0,0,0,8.475967998124098,4.306120486940837,,0,0,0,4.306120486940837,174.51340250229214,,0,0,0,174.51340250229214,55.84137678844489,,0,0,0,55.84137678844489,28.841519533510933,,0,0,0,28.841519533510933,121.27248577487512,,0,0,0,121.27248577487512
8,HIS,8.134236445221445,,0,0,0,8.134236445221445,4.784668155200355,,0,0,0,4.784668155200355,174.6935579436397,,0,0,0,174.6935579436397,54.85143389063159,,0,0,0,54.85143389063159,29.259266933877235,,0,0,0,29.259266933877235,120.46685113258964,,0,0,0,120.46685113258964
9,SER,8.338713377472528,,0,0,0,8.338713377472528,4.377471389216339,,0,0,0,4.377471389216339,173.99104242810523,,0,0,0,173.99104242810523,58.37974042296037,,0,0,0,58.37974042296037,63.205905517515816,,0,0,0,63.205905517515816,118.38608548190143,,0,0,0,118.38608548190143
10,HIS,8.195452790709291,,0,0,0,8.195452790709291,4.7090839661005655,,0,0,0,4.7090839661005655,173.9130091162948,,0,0,0,173.9130091162948,55.03823788994894,,0,0,0,55.03823788994894,29.380468393428792,,0,0,0,29.380468393428792,120.52866278949384,,0,0,0,120.52866278949384
11,MET,8.195364077799978,,0,0,0,8.195364077799978,3.8564382417887666,,0,0,0,3.8564382417887666,176.15974858332225,,0,0,0,176.15974858332225,55.0971735522644,,0,0,0,55.0971735522644,31.92102001169941,,0,0,0,31.92102001169941,119.5947565060384,,0,0,0,119.5947565060384
12,SER,8.512669490914641,,0,0,0,8.512669490914641,4.126276333655234,,0,0,0,4.126276333655234,174.35720254345654,,0,0,0,174.35720254345654,60.38631874213564,,0,0,0,60.38631874213564,63.1398902070485,,0,0,0,63.1398902070485,116.25514486138306,,0,0,0,116.25514486138306
13,TRP,6.483953578088579,,0,0,0,6.483953578088579,4.778141748135198,,0,0,0,4.778141748135198,174.95273003345542,,0,0,0,174.95273003345542,55.13968580794205,,0,0,0,55.13968580794205,29.97750869768565,,0,0,0,29.97750869768565,114.48937278510378,,0,0,0,114.48937278510378
14,TYR,7.774626828538128,,0,0,0,7.774626828538128,5.5464577127206125,,0,0,0,5.5464577127206125,174.86606687820512,,0,0,0,174.86606687820512,56.963020871273166,,0,0,0,56.963020871273166,39.242047247585745,,0,0,0,39.242047247585745,122.81125327182816,,0,0,0,122.81125327182816
15,HIS,8.831404412082362,,0,0,0,8.831404412082362,4.390985267937618,,0,0,0,4.390985267937618,174.74711948568654,,0,0,0,174.74711948568654,54.5637524009657,,0,0,0,54.5637524009657,30.85741797110667,,0,0,0,30.85741797110667,126.06260450275835,,0,0,0,126.06260450275835
16,ARG,8.571545346026197,,0,0,0,8.571545346026197,3.890396928815629,,0,0,0,3.890396928815629,176.127318551221,,0,0,0,176.127318551221,58.187475476157175,,0,0,0,58.187475476157175,30.180914056937507,,0,0,0,30.180914056937507,123.83496479633145,,0,0,0,123.83496479633145
17,ASP,8.234684666272615,,0,0,0,8.234684666272615,4.555973284235209,,0,0,0,4.555973284235209,175.5320885716395,,0,0,0,175.5320885716395,54.678177901931406,,0,0,0,54.678177901931406,40.230272931884784,,0,0,0,40.230272931884784,118.14744071959153,,0,0,0,118.14744071959153
18,LEU,7.725838442979243,,0,0,0,7.725838442979243,4.6153393512709515,,0,0,0,4.6153393512709515,176.45812618637473,,0,0,0,176.45812618637473,54.291047053379955,,0,0,0,54.291047053379955,43.78902034068709,,0,0,0,43.78902034068709,122.3912380121434,,0,0,0,122.3912380121434
19,SER,8.439183602486404,,0,0,0,8.439183602486404,4.812812045054945,,0,0,0,4.812812045054945,174.9775759509879,,0,0,0,174.9775759509879,57.32238941717171,,0,0,0,57.32238941717171,64.89943248040294,,0,0,0,64.89943248040294,120.54694254504385,,0,0,0,120.54694254504385
20,ARG,8.90992462034632,,0,0,0,8.90992462034632,3.7521340898740143,,0,0,0,3.7521340898740143,178.01952063397158,,0,0,0,178.01952063397158,60.47817995115995,,0,0,0,60.47817995115995,29.96667922142857,,0,0,0,29.96667922142857,123.10841082595182,,0,0,0,123.10841082595182
21,ALA,8.260658768137418,,0,0,0,8.260658768137418,4.122170705838606,,0,0,0,4.122170705838606,180.39445862762238,,0,0,0,180.39445862762238,54.85192529390609,,0,0,0,54.85192529390609,17.890958815750917,,0,0,0,17.890958815750917,119.80283757832723,,0,0,0,119.80283757832723
22,ALA,7.887354574281274,,0,0,0,7.887354574281274,4.155433923004773,,0,0,0,4.155433923004773,180.30977970948496,,0,0,0,180.30977970948496,54.658491855172606,,0,0,0,54.658491855172606,18.40654152952603,,0,0,0,18.40654152952603,121.26260414176934,,0,0,0,121.26260414176934
23,ALA,8.53292425952381,,0,0,0,8.53292425952381,3.8377589461177717,,0,0,0,3.8377589461177717,179.05503516504606,,0,0,0,179.05503516504606,55.352518095010545,,0,0,0,55.352518095010545,18.30071760588301,,0,0,0,18.30071760588301,122.56867611970807,,0,0,0,122.56867611970807
24,GLU,8.466965805233656,,0,0,0,8.466965805233656,3.8285075766455767,,0,0,0,3.8285075766455767,178.9464048120435,,0,0,0,178.9464048120435,60.10174752750583,,0,0,0,60.10174752750583,29.192993327361528,,0,0,0,29.192993327361528,116.69055693533134,,0,0,0,116.69055693533134
25,GLU,8.287717522183373,,0,0,0,8.287717522183373,4.025867076315351,,0,0,0,4.025867076315351,179.40598743742925,,0,0,0,179.40598743742925,59.44004703730159,,0,0,0,59.44004703730159,29.429172567804418,,0,0,0,29.429172567804418,120.25184808666889,,0,0,0,120.25184808666889
26,LEU,8.186614546220447,,0,0,0,8.186614546220447,4.1021725478632485,,0,0,0,4.1021725478632485,179.11955366749362,,0,0,0,179.11955366749362,57.893853952952604,,0,0,0,57.893853952952604,42.26128104948385,,0,0,0,42.26128104948385,121.3575331516317,,0,0,0,121.3575331516317
27,LEU,8.441903864713066,,0,0,0,8.441903864713066,3.9815927112332115,,0,0,0,3.9815927112332115,178.755645354107,,0,0,0,178.755645354107,57.90153178595293,,0,0,0,57.90153178595293,41.679187874697526,,0,0,0,41.679187874697526,119.75222742859363,,0,0,0,119.75222742859363
28,ALA,8.298613711316461,,0,0,0,8.298613711316461,3.9185085132561888,,0,0,0,3.9185085132561888,179.6964980858142,,0,0,0,179.6964980858142,54.60284696169941,,0,0,0,54.60284696169941,18.271026979126432,,0,0,0,18.271026979126432,121.52286817576868,,0,0,0,121.52286817576868
29,ARG,7.971208822638473,,0,0,0,7.971208822638473,4.103198243159618,,0,0,0,4.103198243159618,178.23754678170718,,0,0,0,178.23754678170718,58.257560373343324,,0,0,0,58.257560373343324,30.331896118747917,,0,0,0,30.331896118747917,117.66183558591409,,0,0,0,117.66183558591409
30,ALA,8.06037397011322,,0,0,0,8.06037397011322,4.220355585003885,,0,0,0,4.220355585003885,179.04926308179043,,0,0,0,179.04926308179043,53.84362835453435,,0,0,0,53.84362835453435,19.410423021228773,,0,0,0,19.410423021228773,121.68719855889665,,0,0,0,121.68719855889665
31,GLY,8.176596665845265,,0,0,0,8.176596665845265,3.8873241913031418,,0,0,0,3.8873241913031418,173.56405261901432,,0,0,0,173.56405261901432,46.127455605844155,,0,0,0,46.127455605844155,,,0,0,0,,104.43832178189032,,0,0,0,104.43832178189032
32,ARG,7.730330327244978,,0,0,0,7.730330327244978,4.6451098829004325,,0,0,0,4.6451098829004325,174.91980462710623,,0,0,0,174.91980462710623,54.4095866985681,,0,0,0,54.4095866985681,32.393184014879566,,0,0,0,32.393184014879566,119.98050037998668,,0,0,0,119.98050037998668
33,ASP,8.604414591175491,,0,0,0,8.604414591175491,4.505679771886447,,0,0,0,4.505679771886447,177.5217298466922,,0,0,0,177.5217298466922,55.900374682950385,,0,0,0,55.900374682950385,40.616646961888115,,0,0,0,40.616646961888115,123.4623340942613,,0,0,0,123.4623340942613
34,GLY,9.113376854539904,,0,0,0,9.113376854539904,4.117348698584749,,0,0,0,4.117348698584749,174.7064210949495,,0,0,0,174.7064210949495,45.94999316928072,,0,0,0,45.94999316928072,,,0,0,0,,111.68205158407703,,0,0,0,111.68205158407703
35,SER,8.256455564441115,,0,0,0,8.256455564441115,5.476216036097236,,0,0,0,5.476216036097236,174.253781991231,,0,0,0,174.253781991231,59.84609571233766,,0,0,0,59.84609571233766,63.799205655910754,,0,0,0,63.799205655910754,119.00511468284493,,0,0,0,119.00511468284493
36,PHE,9.119648132417582,,0,0,0,9.119648132417582,6.066556545004996,,0,0,0,6.066556545004996,172.91266653318348,,0,0,0,172.91266653318348,55.37332420716506,,0,0,0,55.37332420716506,43.57716739191365,,0,0,0,43.57716739191365,120.52443135993451,,0,0,0,120.52443135993451
37,LEU,9.320355186169387,,0,0,0,9.320355186169387,5.018324910744811,,0,0,0,5.018324910744811,174.6761478110223,,0,0,0,174.6761478110223,54.56723297609058,,0,0,0,54.56723297609058,44.85039618523699,,0,0,0,44.85039618523699,116.04456495686536,,0,0,0,116.04456495686536
38,VAL,9.655444008025306,,0,0,0,9.655444008025306,5.355807854495505,,0,0,0,5.355807854495505,174.44521980367412,,0,0,0,174.44521980367412,60.78934989053724,,0,0,0,60.78934989053724,33.61941815436786,,0,0,0,33.61941815436786,121.40654808594739,,0,0,0,121.40654808594739
39,ARG,9.366878995498947,,0,0,0,9.366878995498947,5.591630582079032,,0,0,0,5.591630582079032,175.18710262045178,,0,0,0,175.18710262045178,52.79724646914752,,0,0,0,52.79724646914752,34.29653951429682,,0,0,0,34.29653951429682,124.48663096514596,,0,0,0,124.48663096514596
40,ASP,8.558721551814852,,0,0,0,8.558721551814852,4.862232146109446,,0,0,0,4.862232146109446,176.21975099517707,,0,0,0,176.21975099517707,55.229902346958596,,0,0,0,55.229902346958596,41.516498902536355,,0,0,0,41.516498902536355,122.7024094380453,,0,0,0,122.7024094380453
41,SER,8.42816038851149,,0,0,0,8.42816038851149,4.508053107647907,,0,0,0,4.508053107647907,175.3555770998446,,0,0,0,175.3555770998446,57.25247082325452,,0,0,0,57.25247082325452,63.479658763819515,,0,0,0,63.479658763819515,118.99744922330447,,0,0,0,118.99744922330447
42,GLU,8.973192647080696,,0,0,0,8.973192647080696,4.085725097957598,,0,0,0,4.085725097957598,177.49443616556775,,0,0,0,177.49443616556775,58.32915842550227,,0,0,0,58.32915842550227,29.582951976062823,,0,0,0,29.582951976062823,128.2919465218226,,0,0,0,128.2919465218226
43,SER,7.950838021162172,,0,0,0,7.950838021162172,4.42613925009435,,0,0,0,4.42613925009435,174.74275658741257,,0,0,0,174.74275658741257,58.925988527733374,,0,0,0,58.925988527733374,63.74411374319569,,0,0,0,63.74411374319569,112.91719013275059,,0,0,0,112.91719013275059
44,VAL,7.502098468104117,,0,0,0,7.502098468104117,4.2198623898989895,,0,0,0,4.2198623898989895,175.032921240121,,0,0,0,175.032921240121,61.78111950181486,,0,0,0,61.78111950181486,33.524882478654675,,0,0,0,33.524882478654675,121.96261298711289,,0,0,0,121.96261298711289
45,ALA,8.49070489049839,,0,0,0,8.49070489049839,4.214900543134643,,0,0,0,4.214900543134643,179.00349887914308,,0,0,0,179.00349887914308,53.80024898680764,,0,0,0,53.80024898680764,18.35567955619381,,0,0,0,18.35567955619381,129.91357251031747,,0,0,0,129.91357251031747
46,GLY,8.64334801910867,,0,0,0,8.64334801910867,3.7778642857697857,,0,0,0,3.7778642857697857,173.4984683462038,,0,0,0,173.4984683462038,45.30864867173382,,0,0,0,45.30864867173382,,,0,0,0,,109.86438878886669,,0,0,0,109.86438878886669
47,ALA,7.8569518326617835,,0,0,0,7.8569518326617835,4.653464512842714,,0,0,0,4.653464512842714,175.8777259048729,,0,0,0,175.8777259048729,51.64963986961372,,0,0,0,51.64963986961372,20.547401745593298,,0,0,0,20.547401745593298,123.21004409191919,,0,0,0,123.21004409191919
48,PHE,9.023199962065712,,0,0,0,9.023199962065712,5.538476772965922,,0,0,0,5.538476772965922,174.5170580341048,,0,0,0,174.5170580341048,56.36196762930403,,0,0,0,56.36196762930403,43.03053777596293,,0,0,0,43.03053777596293,118.26146225482294,,0,0,0,118.26146225482294
49,ALA,9.509907203712952,,0,0,0,9.509907203712952,5.480706126384726,,0,0,0,5.480706126384726,175.29067338241202,,0,0,0,175.29067338241202,50.265482465850816,,0,0,0,50.265482465850816,21.62927181901987,,0,0,0,21.62927181901987,123.13786706376956,,0,0,0,123.13786706376956
50,LEU,9.162200088333888,,0,0,0,9.162200088333888,5.213044655810855,,0,0,0,5.213044655810855,174.72345294777443,,0,0,0,174.72345294777443,53.68399021375846,,0,0,0,53.68399021375846,43.88516256198801,,0,0,0,43.88516256198801,126.43624258719058,,0,0,0,126.43624258719058
51,CYS,9.39097440913531,,0,0,0,9.39097440913531,5.562600484798534,,0,0,0,5.562600484798534,173.3225190961372,,0,0,0,173.3225190961372,57.04547365480076,,0,0,0,57.04547365480076,29.311257506116107,,0,0,0,29.311257506116107,126.97900318981019,,0,0,0,126.97900318981019
52,VAL,9.263464985608834,,0,0,0,9.263464985608834,5.254365415900765,,0,0,0,5.254365415900765,174.10264570661562,,0,0,0,174.10264570661562,59.97212342777223,,0,0,0,59.97212342777223,35.48291766884227,,0,0,0,35.48291766884227,123.51818093079143,,0,0,0,123.51818093079143
53,LEU,9.350664263009214,,0,0,0,9.350664263009214,5.077685083028083,,0,0,0,5.077685083028083,175.07585017644578,,0,0,0,175.07585017644578,54.422705445171495,,0,0,0,54.422705445171495,43.910812337362636,,0,0,0,43.910812337362636,129.12268017432567,,0,0,0,129.12268017432567
54,TYR,9.346096227799977,,0,0,0,9.346096227799977,4.921381796564547,,0,0,0,4.921381796564547,174.7780756385892,,0,0,0,174.7780756385892,58.240677913908314,,0,0,0,58.240677913908314,41.747397977999775,,0,0,0,41.747397977999775,128.4753801441836,,0,0,0,128.4753801441836
55,GLN,9.231630407320457,,0,0,0,9.231630407320457,3.691542366586192,,0,0,0,3.691542366586192,175.66761165174825,,0,0,0,175.66761165174825,56.63916309539905,,0,0,0,56.63916309539905,26.089046038428236,,0,0,0,26.089046038428236,127.67572793419357,,0,0,0,127.67572793419357
56,LYS,8.175089321850372,,0,0,0,8.175089321850372,3.841267521178821,,0,0,0,3.841267521178821,174.91682517455877,,0,0,0,174.91682517455877,57.72444764074259,,0,0,0,57.72444764074259,30.902454739671438,,0,0,0,30.902454739671438,109.15591773735154,,0,0,0,109.15591773735154
57,HIS,8.052869514951714,,0,0,0,8.052869514951714,4.872989025951825,,0,0,0,4.872989025951825,174.26378202242756,,0,0,0,174.26378202242756,55.07510259505494,,0,0,0,55.07510259505494,31.260985104340104,,0,0,0,31.260985104340104,118.23958417458653,,0,0,0,118.23958417458653
58,VAL,8.68667168086358,,0,0,0,8.68667168086358,4.575789532711732,,0,0,0,4.575789532711732,175.61733474374515,,0,0,0,175.61733474374515,62.00641683898324,,0,0,0,62.00641683898324,32.59716746340326,,0,0,0,32.59716746340326,124.24129465871351,,0,0,0,124.24129465871351
59,HIS,9.144414536030636,,0,0,0,9.144414536030636,4.687537905772006,,0,0,0,4.687537905772006,174.18733230777,,0,0,0,174.18733230777,54.57209778395493,,0,0,0,54.57209778395493,31.11096181932512,,0,0,0,31.11096181932512,126.77049731432456,,0,0,0,126.77049731432456
60,THR,8.573366810095461,,0,0,0,8.573366810095461,5.0145588467809965,,0,0,0,5.0145588467809965,173.40793634189143,,0,0,0,173.40793634189143,61.93809102386502,,0,0,0,61.93809102386502,69.63183553944944,,0,0,0,69.63183553944944,120.57895028462092,,0,0,0,120.57895028462092
61,TYR,9.411964659473858,,0,0,0,9.411964659473858,4.768997289471639,,0,0,0,4.768997289471639,174.9649428152625,,0,0,0,174.9649428152625,56.726219649189694,,0,0,0,56.726219649189694,40.23314932022977,,0,0,0,40.23314932022977,128.35022456808747,,0,0,0,128.35022456808747
62,ARG,8.987393085520036,,0,0,0,8.987393085520036,4.825946417077367,,0,0,0,4.825946417077367,175.12828905084916,,0,0,0,175.12828905084916,56.21234087264957,,0,0,0,56.21234087264957,31.77989128861139,,0,0,0,31.77989128861139,123.86480540037739,,0,0,0,123.86480540037739
63,ILE,9.164708075330225,,0,0,0,9.164708075330225,5.05076513929404,,0,0,0,5.05076513929404,174.92981057503607,,0,0,0,174.92981057503607,60.312809994189145,,0,0,0,60.312809994189145,38.9689204491453,,0,0,0,38.9689204491453,124.42628542499723,,0,0,0,124.42628542499723
64,LEU,9.278434625330226,,0,0,0,9.278434625330226,5.152481067993118,,0,0,0,5.152481067993118,174.37515321727716,,0,0,0,174.37515321727716,51.59619602091797,,0,0,0,51.59619602091797,44.014078601970255,,0,0,0,44.014078601970255,129.43089617352092,,0,0,0,129.43089617352092
65,PRO,,,0,0,0,,4.99687883027528,,0,0,0,4.99687883027528,176.82246563114663,,0,0,0,176.82246563114663,62.66700933886669,,0,0,0,62.66700933886669,31.64485310983461,,0,0,0,31.64485310983461,,,0,0,0,
66,ASP,8.943833722871572,,0,0,0,8.943833722871572,4.854843473054723,,0,0,0,4.854843473054723,175.87400071560108,,0,0,0,175.87400071560108,53.83508589131979,,0,0,0,53.83508589131979,42.39583485819181,,0,0,0,42.39583485819181,124.03923715934067,,0,0,0,124.03923715934067
67,GLY,8.031358996731047,,0,0,0,8.031358996731047,4.11541470526973,,0,0,0,4.11541470526973,174.37694738580865,,0,0,0,174.37694738580865,44.74030076890332,,0,0,0,44.74030076890332,,,0,0,0,,108.984796651332,,0,0,0,108.984796651332
68,GLU,8.979879401881451,,0,0,0,8.979879401881451,4.075093631232656,,0,0,0,4.075093631232656,175.91835687355976,,0,0,0,175.91835687355976,57.754148440881345,,0,0,0,57.754148440881345,28.64071260163725,,0,0,0,28.64071260163725,119.14615522566322,,0,0,0,119.14615522566322
69,ASP,8.55438560994006,,0,0,0,8.55438560994006,4.365504859809635,,0,0,0,4.365504859809635,174.89690611623377,,0,0,0,174.89690611623377,55.58975095991231,,0,0,0,55.58975095991231,40.30361186768232,,0,0,0,40.30361186768232,110.4879672805528,,0,0,0,110.4879672805528
70,PHE,8.328279794072595,,0,0,0,8.328279794072595,4.876945944483294,,0,0,0,4.876945944483294,175.41465632343213,,0,0,0,175.41465632343213,57.51031108689089,,0,0,0,57.51031108689089,41.47222472826063,,0,0,0,41.47222472826063,119.77276727671217,,0,0,0,119.77276727671217
71,LEU,9.346476220224222,,0,0,0,9.346476220224222,5.166601540848041,,0,0,0,5.166601540848041,175.71988898828394,,0,0,0,175.71988898828394,53.49901602372628,,0,0,0,53.49901602372628,43.90539948508714,,0,0,0,43.90539948508714,123.45740694205239,,0,0,0,123.45740694205239
72,ALA,9.313453101936952,,0,0,0,9.313453101936952,5.573340472422023,,0,0,0,5.573340472422023,176.165165193229,,0,0,0,176.165165193229,50.299537124259075,,0,0,0,50.299537124259075,22.194739233294484,,0,0,0,22.194739233294484,125.3107272593795,,0,0,0,125.3107272593795
73,VAL,8.878538292479742,,0,0,0,8.878538292479742,4.642013267826617,,0,0,0,4.642013267826617,175.446399014319,,0,0,0,175.446399014319,61.98491177183372,,0,0,0,61.98491177183372,32.50057151919747,,0,0,0,32.50057151919747,123.85663389174714,,0,0,0,123.85663389174714
74,GLN,9.03699926082251,,0,0,0,9.03699926082251,4.567988045027195,,0,0,0,4.567988045027195,175.87818734129758,,0,0,0,175.87818734129758,56.061961051925856,,0,0,0,56.061961051925856,29.142909599894548,,0,0,0,29.142909599894548,128.1712834704351,,0,0,0,128.1712834704351
75,THR,8.2162189489122,,0,0,0,8.2162189489122,4.663174117471417,,0,0,0,4.663174117471417,174.74976976626706,,0,0,0,174.74976976626706,60.71527193651348,,0,0,0,60.71527193651348,70.31745001080586,,0,0,0,70.31745001080586,114.94987896532356,,0,0,0,114.94987896532356
76,SER,8.79091729012654,,0,0,0,8.79091729012654,4.523995508208458,,0,0,0,4.523995508208458,174.56752661622266,,0,0,0,174.56752661622266,58.333617668303916,,0,0,0,58.333617668303916,64.07082162943168,,0,0,0,64.07082162943168,117.26427966776002,,0,0,0,117.26427966776002
77,GLN,8.522489096830947,,0,0,0,8.522489096830947,4.000218844122545,,0,0,0,4.000218844122545,176.90814730861916,,0,0,0,176.90814730861916,57.45792677638473,,0,0,0,57.45792677638473,28.680601496148295,,0,0,0,28.680601496148295,122.01851045869685,,0,0,0,122.01851045869685
78,GLY,8.82355819929515,,0,0,0,8.82355819929515,3.984466967546343,,0,0,0,3.984466967546343,174.22924353029748,,0,0,0,174.22924353029748,45.386597392940395,,0,0,0,45.386597392940395,,,0,0,0,,111.9091129539183,,0,0,0,111.9091129539183
79,VAL,7.632986413769563,,0,0,0,7.632986413769563,4.269697588192364,,0,0,0,4.269697588192364,174.4888962975136,,0,0,0,174.4888962975136,59.880745187551334,,0,0,0,59.880745187551334,32.739529841181046,,0,0,0,32.739529841181046,123.84897727473083,,0,0,0,123.84897727473083
80,PRO,,,0,0,0,,4.4846724379287375,,0,0,0,4.4846724379287375,176.43724101643357,,0,0,0,176.43724101643357,62.92671668561994,,0,0,0,62.92671668561994,32.055627830103234,,0,0,0,32.055627830103234,,,0,0,0,
81,VAL,8.260268205511155,,0,0,0,8.260268205511155,4.058510787354312,,0,0,0,4.058510787354312,175.9451293356366,,0,0,0,175.9451293356366,62.103252352680656,,0,0,0,62.103252352680656,32.411476468265064,,0,0,0,32.411476468265064,121.39521668311133,,0,0,0,121.39521668311133
82,ARG,8.533470106410256,,0,0,0,8.533470106410256,4.37063239997225,,0,0,0,4.37063239997225,174.64593854800756,,0,0,0,174.64593854800756,55.191692985470084,,0,0,0,55.191692985470084,31.61329276811522,,0,0,0,31.61329276811522,126.60796113153513,,0,0,0,126.60796113153513
83,ARG,7.967366598606949,,0,0,0,7.967366598606949,5.072358956965257,,0,0,0,5.072358956965257,175.4411285478688,,0,0,0,175.4411285478688,54.83843726895882,,0,0,0,54.83843726895882,32.20303281098901,,0,0,0,32.20303281098901,122.34007139138639,,0,0,0,122.34007139138639
84,PHE,9.30453720910756,,0,0,0,9.30453720910756,5.050000890492841,,0,0,0,5.050000890492841,176.19926721633922,,0,0,0,176.19926721633922,56.78051960911866,,0,0,0,56.78051960911866,42.834475718437126,,0,0,0,42.834475718437126,121.44058006370851,,0,0,0,121.44058006370851
85,GLN,9.058859681734932,,0,0,0,9.058859681734932,4.211043232878233,,0,0,0,4.211043232878233,176.51764299212454,,0,0,0,176.51764299212454,58.07832627520257,,0,0,0,58.07832627520257,29.711684973792874,,0,0,0,29.711684973792874,120.55496156808746,,0,0,0,120.55496156808746
86,THR,8.189908512626262,,0,0,0,8.189908512626262,4.669670638450438,,0,0,0,4.669670638450438,175.12151018285047,,0,0,0,175.12151018285047,59.79422464236874,,0,0,0,59.79422464236874,71.7164182599234,,0,0,0,71.7164182599234,107.64286893226773,,0,0,0,107.64286893226773
87,LEU,8.783383757292707,,0,0,0,8.783383757292707,3.8089808223720727,,0,0,0,3.8089808223720727,178.40695733545343,,0,0,0,178.40695733545343,57.896931704401155,,0,0,0,57.896931704401155,41.03999673767899,,0,0,0,41.03999673767899,123.20393372640692,,0,0,0,123.20393372640692
88,GLY,8.490180092146742,,0,0,0,8.490180092146742,3.851843217415917,,0,0,0,3.851843217415917,176.34416393184594,,0,0,0,176.34416393184594,47.27145239094794,,0,0,0,47.27145239094794,,,0,0,0,,106.21097061304806,,0,0,0,106.21097061304806
89,GLU,7.887904068742369,,0,0,0,7.887904068742369,4.006621153918304,,0,0,0,4.006621153918304,178.68091476834832,,0,0,0,178.68091476834832,59.097153167193916,,0,0,0,59.097153167193916,30.10962272134532,,0,0,0,30.10962272134532,122.03870406877012,,0,0,0,122.03870406877012