RESNUM,RESNAME,H_X,H_Y,H_BEST_REF_SCORE,H_BEST_REF_COV,H_BEST_REF_MATCH,H_UCBShift,HA_X,HA_Y,HA_BEST_REF_SCORE,HA_BEST_REF_COV,HA_BEST_REF_MATCH,HA_UCBShift,C_X,C_Y,C_BEST_REF_SCORE,C_BEST_REF_COV,C_BEST_REF_MATCH,C_UCBShift,CA_X,CA_Y,CA_BEST_REF_SCORE,CA_BEST_REF_COV,CA_BEST_REF_MATCH,CA_UCBShift,CB_X,CB_Y,CB_BEST_REF_SCORE,CB_BEST_REF_COV,CB_BEST_REF_MATCH,CB_UCBShift,N_X,N_Y,N_BEST_REF_SCORE,N_BEST_REF_COV,N_BEST_REF_MATCH,N_UCBShift
1,MET,8.41123327197247,,0,0,0,8.41123327197247,4.313738582412032,,0,0,0,4.313738582412032,173.02489267891,,0,0,0,173.02489267891,55.23418658318348,,0,0,0,55.23418658318348,33.08489560310245,,0,0,0,33.08489560310245,120.5818078480575,,0,0,0,120.5818078480575
2,ASN,8.634855207930958,,0,0,0,8.634855207930958,5.186988991430792,,0,0,0,5.186988991430792,174.2254160513875,,0,0,0,174.2254160513875,52.158568978971026,,0,0,0,52.158568978971026,40.27209612087357,,0,0,0,40.27209612087357,121.52948017743368,,0,0,0,121.52948017743368
3,ILE,8.772890418242868,,0,0,0,8.772890418242868,4.339573432622933,,0,0,0,4.339573432622933,174.74235632901542,,0,0,0,174.74235632901542,60.23119503156288,,0,0,0,60.23119503156288,38.96141981566211,,0,0,0,38.96141981566211,124.0587568530414,,0,0,0,124.0587568530414
4,THR,8.29977673006438,,0,0,0,8.29977673006438,5.09453017072372,,0,0,0,5.09453017072372,173.8662560329115,,0,0,0,173.8662560329115,61.32186521694416,,0,0,0,61.32186521694416,70.38032247774447,,0,0,0,70.38032247774447,122.33836664342324,,0,0,0,122.33836664342324
5,VAL,9.155902707642356,,0,0,0,9.155902707642356,4.7473854746364745,,0,0,0,4.7473854746364745,174.36462921662783,,0,0,0,174.36462921662783,59.77047882523588,,0,0,0,59.77047882523588,34.95989203014208,,0,0,0,34.95989203014208,122.94573047691198,,0,0,0,122.94573047691198
6,GLU,8.597822826423576,,0,0,0,8.597822826423576,5.577158585364635,,0,0,0,5.577158585364635,175.52826764007102,,0,0,0,175.52826764007102,54.56383056319791,,0,0,0,54.56383056319791,33.78671112082362,,0,0,0,33.78671112082362,121.92877896433012,,0,0,0,121.92877896433012
7,THR,8.799881237973137,,0,0,0,8.799881237973137,4.69453246040071,,0,0,0,4.69453246040071,172.58599169957265,,0,0,0,172.58599169957265,60.75296456126651,,0,0,0,60.75296456126651,70.63661699183594,,0,0,0,70.63661699183594,115.54100099121989,,0,0,0,115.54100099121989
8,THR,8.632745326934177,,0,0,0,8.632745326934177,4.883451859052059,,0,0,0,4.883451859052059,173.78024260270283,,0,0,0,173.78024260270283,61.94337796139416,,0,0,0,61.94337796139416,69.43480859212454,,0,0,0,69.43480859212454,121.48423096957487,,0,0,0,121.48423096957487
9,VAL,9.143276603013652,,0,0,0,9.143276603013652,4.314993338222888,,0,0,0,4.314993338222888,175.12176400697635,,0,0,0,175.12176400697635,61.43519941269842,,0,0,0,61.43519941269842,32.96454271019536,,0,0,0,32.96454271019536,127.35198697328782,,0,0,0,127.35198697328782
10,ALA,8.795877093112443,,0,0,0,8.795877093112443,4.522678045687646,,0,0,0,4.522678045687646,176.4863985932179,,0,0,0,176.4863985932179,52.532795525779775,,0,0,0,52.532795525779775,17.84618027974248,,0,0,0,17.84618027974248,131.16310972736153,,0,0,0,131.16310972736153
11,ALA,8.265256947657898,,0,0,0,8.265256947657898,4.696734417227217,,0,0,0,4.696734417227217,174.03293709508824,,0,0,0,174.03293709508824,49.65896815660451,,0,0,0,49.65896815660451,19.915356225274728,,0,0,0,19.915356225274728,122.43845189827395,,0,0,0,122.43845189827395
12,PRO,,,0,0,0,,4.502838415120991,,0,0,0,4.502838415120991,178.2286905967477,,0,0,0,178.2286905967477,62.67547667887113,,0,0,0,62.67547667887113,32.40779557974803,,0,0,0,32.40779557974803,,,0,0,0,
13,VAL,8.754753962698413,,0,0,0,8.754753962698413,3.811645140112665,,0,0,0,3.811645140112665,176.8074749360473,,0,0,0,176.8074749360473,66.2769966001443,,0,0,0,66.2769966001443,31.784606085031637,,0,0,0,31.784606085031637,122.8701657504107,,0,0,0,122.8701657504107
14,GLY,8.502507473415474,,0,0,0,8.502507473415474,3.878201860353535,,0,0,0,3.878201860353535,176.39649136419138,,0,0,0,176.39649136419138,47.03765122528583,,0,0,0,47.03765122528583,,,0,0,0,,109.91941843635809,,0,0,0,109.91941843635809
15,LYS,7.8703070152680645,,0,0,0,7.8703070152680645,4.189039345010545,,0,0,0,4.189039345010545,179.02070580255855,,0,0,0,179.02070580255855,59.02628964241314,,0,0,0,59.02628964241314,32.792473470679326,,0,0,0,32.792473470679326,122.75908116105562,,0,0,0,122.75908116105562
16,VAL,8.26069192224442,,0,0,0,8.26069192224442,3.7754134857059607,,0,0,0,3.7754134857059607,177.45872981143856,,0,0,0,177.45872981143856,67.14239815293041,,0,0,0,67.14239815293041,31.657566525557776,,0,0,0,31.657566525557776,120.763080544006,,0,0,0,120.763080544006
17,TRP,8.93661215983461,,0,0,0,8.93661215983461,3.9452118046536797,,0,0,0,3.9452118046536797,177.69404586584525,,0,0,0,177.69404586584525,61.34271831264846,,0,0,0,61.34271831264846,29.604244103707405,,0,0,0,29.604244103707405,120.95303266667221,,0,0,0,120.95303266667221
18,ARG,8.16937611953047,,0,0,0,8.16937611953047,4.115428358646908,,0,0,0,4.115428358646908,178.93439706148297,,0,0,0,178.93439706148297,59.454054154834054,,0,0,0,59.454054154834054,30.25364139009879,,0,0,0,30.25364139009879,118.69359974214119,,0,0,0,118.69359974214119
19,ALA,8.354613470862471,,0,0,0,8.354613470862471,4.263397250047175,,0,0,0,4.263397250047175,178.55207385457877,,0,0,0,178.55207385457877,55.09185992912088,,0,0,0,55.09185992912088,18.43188246911422,,0,0,0,18.43188246911422,122.64310547478077,,0,0,0,122.64310547478077
20,TYR,8.38712945955156,,0,0,0,8.38712945955156,4.076674278069153,,0,0,0,4.076674278069153,177.1894234666611,,0,0,0,177.1894234666611,61.27578376603397,,0,0,0,61.27578376603397,38.98210345047175,,0,0,0,38.98210345047175,119.41118013192917,,0,0,0,119.41118013192917
21,THR,7.949064536291487,,0,0,0,7.949064536291487,4.410590837562437,,0,0,0,4.410590837562437,174.45550765061603,,0,0,0,174.45550765061603,61.748045018697965,,0,0,0,61.748045018697965,69.81605308694638,,0,0,0,69.81605308694638,108.30982572000222,,0,0,0,108.30982572000222
22,THR,7.6873190999556,,0,0,0,7.6873190999556,4.624752303679654,,0,0,0,4.624752303679654,173.805790960101,,0,0,0,173.805790960101,60.198132428998775,,0,0,0,60.198132428998775,70.10978970744256,,0,0,0,70.10978970744256,120.97452901394162,,0,0,0,120.97452901394162
23,PRO,,,0,0,0,,3.9748695410561665,,0,0,0,3.9748695410561665,178.18575263326673,,0,0,0,178.18575263326673,65.60630109931179,,0,0,0,65.60630109931179,32.00894191252081,,0,0,0,32.00894191252081,,,0,0,0,
24,GLU,9.210658962631813,,0,0,0,9.210658962631813,3.9381098167499173,,0,0,0,3.9381098167499173,179.23210878868355,,0,0,0,179.23210878868355,59.94710191962482,,0,0,0,59.94710191962482,28.911150326606727,,0,0,0,28.911150326606727,115.78542599083694,,0,0,0,115.78542599083694
25,ASP,7.893350918675768,,0,0,0,7.893350918675768,4.55626726978022,,0,0,0,4.55626726978022,178.55266481204907,,0,0,0,178.55266481204907,57.327493847807744,,0,0,0,57.327493847807744,41.42204176408592,,0,0,0,41.42204176408592,120.83852609643135,,0,0,0,120.83852609643135
26,ILE,8.514225673282274,,0,0,0,8.514225673282274,3.0261684822649553,,0,0,0,3.0261684822649553,177.3820379566489,,0,0,0,177.3820379566489,65.60581352131757,,0,0,0,65.60581352131757,38.255489478582525,,0,0,0,38.255489478582525,121.00026188867244,,0,0,0,121.00026188867244
27,LYS,7.948420548823398,,0,0,0,7.948420548823398,3.686122657770008,,0,0,0,3.686122657770008,178.34836957929292,,0,0,0,178.34836957929292,59.51374243839494,,0,0,0,59.51374243839494,32.09246782887668,,0,0,0,32.09246782887668,117.56895686579533,,0,0,0,117.56895686579533
28,GLN,7.749555490548341,,0,0,0,7.749555490548341,4.127123186568986,,0,0,0,4.127123186568986,177.54569573635808,,0,0,0,177.54569573635808,57.893583488472636,,0,0,0,57.893583488472636,28.944817255339103,,0,0,0,28.944817255339103,115.96436957703962,,0,0,0,115.96436957703962
29,TRP,7.821208137828838,,0,0,0,7.821208137828838,4.672996166655567,,0,0,0,4.672996166655567,176.8769267996892,,0,0,0,176.8769267996892,58.44186016551782,,0,0,0,58.44186016551782,30.38362615557776,,0,0,0,30.38362615557776,115.32712429780774,,0,0,0,115.32712429780774
30,ASN,8.045716641824843,,0,0,0,8.045716641824843,4.36555796977467,,0,0,0,4.36555796977467,174.5252279082029,,0,0,0,174.5252279082029,53.686844663342214,,0,0,0,53.686844663342214,38.57019091120546,,0,0,0,38.57019091120546,117.78973756418581,,0,0,0,117.78973756418581
31,ALA,7.585042429370629,,0,0,0,7.585042429370629,4.170062895648796,,0,0,0,4.170062895648796,177.1343588831613,,0,0,0,177.1343588831613,52.159048412376514,,0,0,0,52.159048412376514,19.13962333701299,,0,0,0,19.13962333701299,122.71955651502387,,0,0,0,122.71955651502387
32,ALA,8.474583226212676,,0,0,0,8.474583226212676,4.152807110558886,,0,0,0,4.152807110558886,177.16778461751582,,0,0,0,177.16778461751582,54.24315365899101,,0,0,0,54.24315365899101,19.334293862648465,,0,0,0,19.334293862648465,125.73121590530026,,0,0,0,125.73121590530026
33,SER,7.734493454057054,,0,0,0,7.734493454057054,4.608373583477634,,0,0,0,4.608373583477634,175.14282238015318,,0,0,0,175.14282238015318,56.93566320888001,,0,0,0,56.93566320888001,65.47932129305138,,0,0,0,65.47932129305138,111.41464761218782,,0,0,0,111.41464761218782
34,ASP,8.819504020640471,,0,0,0,8.819504020640471,4.434927923681873,,0,0,0,4.434927923681873,176.62434591353647,,0,0,0,176.62434591353647,56.63483219051504,,0,0,0,56.63483219051504,40.54051578887779,,0,0,0,40.54051578887779,123.66617956875902,,0,0,0,123.66617956875902
35,ASP,8.177679448812299,,0,0,0,8.177679448812299,4.5798420885531135,,0,0,0,4.5798420885531135,175.05933428217895,,0,0,0,175.05933428217895,55.33765196262627,,0,0,0,55.33765196262627,40.72011057292153,,0,0,0,40.72011057292153,117.84064466517373,,0,0,0,117.84064466517373
36,TRP,7.988238710467311,,0,0,0,7.988238710467311,4.977801353096903,,0,0,0,4.977801353096903,175.55991621303696,,0,0,0,175.55991621303696,56.63921000975691,,0,0,0,56.63921000975691,31.933628682717284,,0,0,0,31.933628682717284,121.16393246689421,,0,0,0,121.16393246689421
37,HIS,9.315820172261072,,0,0,0,9.315820172261072,4.977014726157176,,0,0,0,4.977014726157176,173.4741360213342,,0,0,0,173.4741360213342,54.425602846115,,0,0,0,54.425602846115,32.32299611613387,,0,0,0,32.32299611613387,117.50362742263847,,0,0,0,117.50362742263847
38,THR,8.69641244812965,,0,0,0,8.69641244812965,5.15882127016317,,0,0,0,5.15882127016317,174.5785363194694,,0,0,0,174.5785363194694,61.6930140999445,,0,0,0,61.6930140999445,69.11257370700966,,0,0,0,69.11257370700966,119.31711141705517,,0,0,0,119.31711141705517
39,THR,8.706968114668665,,0,0,0,8.706968114668665,4.284426853563104,,0,0,0,4.284426853563104,174.93075092884337,,0,0,0,174.93075092884337,62.455074735286935,,0,0,0,62.455074735286935,69.01219454027638,,0,0,0,69.01219454027638,120.36053601935842,,0,0,0,120.36053601935842
40,ALA,7.615165731734932,,0,0,0,7.615165731734932,4.699631057026307,,0,0,0,4.699631057026307,175.43920236222667,,0,0,0,175.43920236222667,51.549448488400486,,0,0,0,51.549448488400486,22.073782681318683,,0,0,0,22.073782681318683,123.91315422700633,,0,0,0,123.91315422700633
41,ALA,8.590706184737485,,0,0,0,8.590706184737485,5.319656675285826,,0,0,0,5.319656675285826,175.55432915323567,,0,0,0,175.55432915323567,50.943700786369185,,0,0,0,50.943700786369185,23.119747173676327,,0,0,0,23.119747173676327,123.8602677476468,,0,0,0,123.8602677476468
42,THR,8.879265718387169,,0,0,0,8.879265718387169,4.639925267499168,,0,0,0,4.639925267499168,172.8394978201132,,0,0,0,172.8394978201132,60.502284682228876,,0,0,0,60.502284682228876,71.52391288660783,,0,0,0,71.52391288660783,113.48993731982462,,0,0,0,113.48993731982462
43,VAL,8.68227526170496,,0,0,0,8.68227526170496,4.565337932162282,,0,0,0,4.565337932162282,174.6903010820846,,0,0,0,174.6903010820846,61.86524258705739,,0,0,0,61.86524258705739,34.607840433405485,,0,0,0,34.607840433405485,124.175297392785,,0,0,0,124.175297392785
44,ASP,8.71627473963814,,0,0,0,8.71627473963814,4.834874974708625,,0,0,0,4.834874974708625,176.0176745612332,,0,0,0,176.0176745612332,52.93409669807415,,0,0,0,52.93409669807415,41.53668678690754,,0,0,0,41.53668678690754,127.78509112057388,,0,0,0,127.78509112057388
45,LEU,8.326698033949384,,0,0,0,8.326698033949384,3.976451666533467,,0,0,0,3.976451666533467,175.8573247518093,,0,0,0,175.8573247518093,54.871280640470644,,0,0,0,54.871280640470644,41.00077127109002,,0,0,0,41.00077127109002,125.27002042586302,,0,0,0,125.27002042586302
46,ARG,8.243100942662894,,0,0,0,8.243100942662894,4.604897296958597,,0,0,0,4.604897296958597,175.5449798037296,,0,0,0,175.5449798037296,54.76509051706072,,0,0,0,54.76509051706072,32.27608602871573,,0,0,0,32.27608602871573,122.35926447167832,,0,0,0,122.35926447167832
47,GLU,8.630463517943168,,0,0,0,8.630463517943168,3.994562663650238,,0,0,0,3.994562663650238,177.44193948393828,,0,0,0,177.44193948393828,58.46631934785215,,0,0,0,58.46631934785215,29.442686047463646,,0,0,0,29.442686047463646,121.6921589998224,,0,0,0,121.6921589998224
48,GLY,9.348982620779221,,0,0,0,9.348982620779221,4.040797958793984,,0,0,0,4.040797958793984,175.02636817792208,,0,0,0,175.02636817792208,45.49452612680098,,0,0,0,45.49452612680098,,,0,0,0,,114.05939018972694,,0,0,0,114.05939018972694
49,GLY,8.330868497219447,,0,0,0,8.330868497219447,4.13428393056943,,0,0,0,4.13428393056943,172.81438465322455,,0,0,0,172.81438465322455,45.04019316201576,,0,0,0,45.04019316201576,,,0,0,0,,109.94721568325008,,0,0,0,109.94721568325008
50,ALA,8.37544717818293,,0,0,0,8.37544717818293,5.217780722705073,,0,0,0,5.217780722705073,176.94391422826618,,0,0,0,176.94391422826618,50.95285262819958,,0,0,0,50.95285262819958,21.494505794233547,,0,0,0,21.494505794233547,123.52265662188367,,0,0,0,123.52265662188367
51,PHE,8.983477296614497,,0,0,0,8.983477296614497,5.349846761888111,,0,0,0,5.349846761888111,173.66204726182707,,0,0,0,173.66204726182707,55.34924492840493,,0,0,0,55.34924492840493,42.86457131541792,,0,0,0,42.86457131541792,118.17842752969807,,0,0,0,118.17842752969807
52,SER,9.043158595626595,,0,0,0,9.043158595626595,5.1267026714341215,,0,0,0,5.1267026714341215,173.23977717791652,,0,0,0,173.23977717791652,57.17691658750138,,0,0,0,57.17691658750138,65.20271810713731,,0,0,0,65.20271810713731,116.46840762816628,,0,0,0,116.46840762816628
53,SER,9.251645724791874,,0,0,0,9.251645724791874,5.1834108847374845,,0,0,0,5.1834108847374845,172.72028448286713,,0,0,0,172.72028448286713,57.262170294216894,,0,0,0,57.262170294216894,65.44668661114996,,0,0,0,65.44668661114996,120.50669536870353,,0,0,0,120.50669536870353
54,ARG,9.030373394227993,,0,0,0,9.030373394227993,4.603188067954268,,0,0,0,4.603188067954268,174.6889707402542,,0,0,0,174.6889707402542,55.45529222966478,,0,0,0,55.45529222966478,31.233752143850595,,0,0,0,31.233752143850595,125.90312505689866,,0,0,0,125.90312505689866
55,MET,9.02486358881674,,0,0,0,9.02486358881674,5.191102319458319,,0,0,0,5.191102319458319,174.54856032819959,,0,0,0,174.54856032819959,54.007999949184146,,0,0,0,54.007999949184146,33.927630723121325,,0,0,0,33.927630723121325,126.67694400952381,,0,0,0,126.67694400952381
56,GLU,9.089983813092463,,0,0,0,9.089983813092463,5.085509194749695,,0,0,0,5.085509194749695,174.87015773561438,,0,0,0,174.87015773561438,54.423016663297815,,0,0,0,54.423016663297815,33.69363311421911,,0,0,0,33.69363311421911,121.87304280586636,,0,0,0,121.87304280586636
57,ALA,8.509995472166722,,0,0,0,8.509995472166722,3.7079991425102676,,0,0,0,3.7079991425102676,179.1232565480464,,0,0,0,179.1232565480464,52.081061953402155,,0,0,0,52.081061953402155,18.295367332278833,,0,0,0,18.295367332278833,126.02105829223,,0,0,0,126.02105829223
58,LYS,8.785502267698966,,0,0,0,8.785502267698966,3.704790530155955,,0,0,0,3.704790530155955,176.2954841540848,,0,0,0,176.2954841540848,58.59079936157731,,0,0,0,58.59079936157731,32.32626175583861,,0,0,0,32.32626175583861,123.04758818959374,,0,0,0,123.04758818959374
59,ASP,7.917663862487513,,0,0,0,7.917663862487513,4.499923235969586,,0,0,0,4.499923235969586,177.10041710044402,,0,0,0,177.10041710044402,53.590903691791546,,0,0,0,53.590903691791546,40.08568942303253,,0,0,0,40.08568942303253,116.22913776464092,,0,0,0,116.22913776464092
60,GLY,7.915219697496948,,0,0,0,7.915219697496948,3.849054401198801,,0,0,0,3.849054401198801,174.83718673299478,,0,0,0,174.83718673299478,46.04303291266511,,0,0,0,46.04303291266511,,,0,0,0,,109.78713822732823,,0,0,0,109.78713822732823
61,SER,8.220842956315908,,0,0,0,8.220842956315908,4.308618829104229,,0,0,0,4.308618829104229,174.50177808354977,,0,0,0,174.50177808354977,59.78827142372627,,0,0,0,59.78827142372627,63.821063456138305,,0,0,0,63.821063456138305,115.65218979070929,,0,0,0,115.65218979070929
62,MET,7.782834737101786,,0,0,0,7.782834737101786,4.622963623459873,,0,0,0,4.622963623459873,174.34936839633147,,0,0,0,174.34936839633147,55.15612974576534,,0,0,0,55.15612974576534,34.90626712138972,,0,0,0,34.90626712138972,119.46244834597624,,0,0,0,119.46244834597624
63,GLY,8.452988683732933,,0,0,0,8.452988683732933,4.115204225333001,,0,0,0,4.115204225333001,172.45858899264624,,0,0,0,172.45858899264624,45.613532973476524,,0,0,0,45.613532973476524,,,0,0,0,,109.11785085245864,,0,0,0,109.11785085245864
64,PHE,9.063535511222112,,0,0,0,9.063535511222112,4.991862100926851,,0,0,0,4.991862100926851,173.09967157610168,,0,0,0,173.09967157610168,56.16932078698524,,0,0,0,56.16932078698524,41.35648448701299,,0,0,0,41.35648448701299,119.32061720768675,,0,0,0,119.32061720768675
65,ASP,8.767684405328005,,0,0,0,8.767684405328005,5.006507695121545,,0,0,0,5.006507695121545,175.22550370064937,,0,0,0,175.22550370064937,53.948581912948164,,0,0,0,53.948581912948164,41.46125458183484,,0,0,0,41.46125458183484,121.79609261834833,,0,0,0,121.79609261834833
66,PHE,9.181359047213897,,0,0,0,9.181359047213897,4.803960570779221,,0,0,0,4.803960570779221,174.4670779259241,,0,0,0,174.4670779259241,57.121660673781776,,0,0,0,57.121660673781776,39.50038240545011,,0,0,0,39.50038240545011,126.42737259134199,,0,0,0,126.42737259134199
67,ALA,8.303184954206904,,0,0,0,8.303184954206904,4.793114918376069,,0,0,0,4.793114918376069,176.13928446383616,,0,0,0,176.13928446383616,50.17097795654901,,0,0,0,50.17097795654901,21.405001774381176,,0,0,0,21.405001774381176,129.82835974453326,,0,0,0,129.82835974453326
68,GLY,8.005277814513265,,0,0,0,8.005277814513265,3.653320422391496,,0,0,0,3.653320422391496,172.35047237346544,,0,0,0,172.35047237346544,45.18195784245199,,0,0,0,45.18195784245199,,,0,0,0,,108.0024685543845,,0,0,0,108.0024685543845
69,THR,8.775353269358419,,0,0,0,8.775353269358419,4.864368352458652,,0,0,0,4.864368352458652,173.965478920424,,0,0,0,173.965478920424,61.68416225673216,,0,0,0,61.68416225673216,70.45376456327561,,0,0,0,70.45376456327561,117.07699603592518,,0,0,0,117.07699603592518
70,TYR,9.387649416272616,,0,0,0,9.387649416272616,5.394250120984571,,0,0,0,5.394250120984571,176.31473084586526,,0,0,0,176.31473084586526,58.4561465968365,,0,0,0,58.4561465968365,38.91013750813631,,0,0,0,38.91013750813631,126.96728742869352,,0,0,0,126.96728742869352
71,THR,9.357459302053503,,0,0,0,9.357459302053503,4.425814252028527,,0,0,0,4.425814252028527,175.03794640236984,,0,0,0,175.03794640236984,62.582590719419464,,0,0,0,62.582590719419464,69.17954587679543,,0,0,0,69.17954587679543,116.10046949060384,,0,0,0,116.10046949060384
72,LYS,8.096487144494393,,0,0,0,8.096487144494393,4.682361161777112,,0,0,0,4.682361161777112,174.49092187583526,,0,0,0,174.49092187583526,55.47841787828283,,0,0,0,55.47841787828283,36.207859929681426,,0,0,0,36.207859929681426,121.4917755450938,,0,0,0,121.4917755450938
73,VAL,8.708967099106449,,0,0,0,8.708967099106449,4.776935069158618,,0,0,0,4.776935069158618,174.37821473991565,,0,0,0,174.37821473991565,62.41476280849706,,0,0,0,62.41476280849706,34.135989482295486,,0,0,0,34.135989482295486,124.85435291970808,,0,0,0,124.85435291970808
74,VAL,9.455073735037184,,0,0,0,9.455073735037184,4.3708733667998665,,0,0,0,4.3708733667998665,175.30309687630702,,0,0,0,175.30309687630702,61.501068554906205,,0,0,0,61.501068554906205,33.97204720993451,,0,0,0,33.97204720993451,127.94760199739704,,0,0,0,127.94760199739704
75,GLU,8.925757827355978,,0,0,0,8.925757827355978,3.7564206845515593,,0,0,0,3.7564206845515593,176.0204660521423,,0,0,0,176.0204660521423,58.05661655740371,,0,0,0,58.05661655740371,29.55570972869353,,0,0,0,29.55570972869353,127.76115101011766,,0,0,0,127.76115101011766
76,ASN,7.72464304996115,,0,0,0,7.72464304996115,3.9681453480408484,,0,0,0,3.9681453480408484,174.84693382286602,,0,0,0,174.84693382286602,54.74451203182928,,0,0,0,54.74451203182928,38.07197654593185,,0,0,0,38.07197654593185,118.20871455932401,,0,0,0,118.20871455932401
77,LYS,7.962426212021311,,0,0,0,7.962426212021311,4.674523544433344,,0,0,0,4.674523544433344,176.10217800217004,,0,0,0,176.10217800217004,57.96104841748807,,0,0,0,57.96104841748807,35.5133408908092,,0,0,0,35.5133408908092,117.56823538362194,,0,0,0,117.56823538362194
78,ARG,8.250424946930847,,0,0,0,8.250424946930847,5.464203254273503,,0,0,0,5.464203254273503,173.87543069810746,,0,0,0,173.87543069810746,55.65028168179043,,0,0,0,55.65028168179043,34.165762165612165,,0,0,0,34.165762165612165,120.64572005947386,,0,0,0,120.64572005947386
79,ILE,9.294322847957599,,0,0,0,9.294322847957599,5.257565912820512,,0,0,0,5.257565912820512,174.5335187809968,,0,0,0,174.5335187809968,60.52978345799201,,0,0,0,60.52978345799201,41.6431622005772,,0,0,0,41.6431622005772,124.66397351833723,,0,0,0,124.66397351833723
80,GLU,9.22417469109224,,0,0,0,9.22417469109224,5.41359121006771,,0,0,0,5.41359121006771,175.678811389344,,0,0,0,175.678811389344,54.43745723085803,,0,0,0,54.43745723085803,33.019404685653235,,0,0,0,33.019404685653235,126.78377676310912,,0,0,0,126.78377676310912
81,TYR,8.982407047358196,,0,0,0,8.982407047358196,5.782009636746587,,0,0,0,5.782009636746587,172.98185880854146,,0,0,0,172.98185880854146,55.62393262190587,,0,0,0,55.62393262190587,41.51808583599178,,0,0,0,41.51808583599178,119.80802461343102,,0,0,0,119.80802461343102
82,ALA,9.302610790159841,,0,0,0,9.302610790159841,5.407046608541458,,0,0,0,5.407046608541458,175.9976325282107,,0,0,0,175.9976325282107,50.24669466476856,,0,0,0,50.24669466476856,21.585152229992232,,0,0,0,21.585152229992232,123.7367322414863,,0,0,0,123.7367322414863
83,PHE,9.090055861027862,,0,0,0,9.090055861027862,5.086347030508381,,0,0,0,5.086347030508381,175.87500932393718,,0,0,0,175.87500932393718,56.26783371669997,,0,0,0,56.26783371669997,40.93549003064713,,0,0,0,40.93549003064713,120.66014009251859,,0,0,0,120.66014009251859
84,GLY,9.111455367649018,,0,0,0,9.111455367649018,3.8004273908868917,,0,0,0,3.8004273908868917,174.6188691824842,,0,0,0,174.6188691824842,46.94073509007659,,0,0,0,46.94073509007659,,,0,0,0,,114.7673744045177,,0,0,0,114.7673744045177
85,ASP,8.662691957503608,,0,0,0,8.662691957503608,4.593662816988567,,0,0,0,4.593662816988567,175.26289701229882,,0,0,0,175.26289701229882,54.32222700677656,,0,0,0,54.32222700677656,40.54217266334776,,0,0,0,40.54217266334776,125.64310691237097,,0,0,0,125.64310691237097
86,ARG,7.457784064435565,,0,0,0,7.457784064435565,4.487697943678543,,0,0,0,4.487697943678543,174.88986113938284,,0,0,0,174.88986113938284,54.460638746420244,,0,0,0,54.460638746420244,32.07111279054834,,0,0,0,32.07111279054834,120.61403496477966,,0,0,0,120.61403496477966
87,THR,8.513186505244756,,0,0,0,8.513186505244756,5.209645707581307,,0,0,0,5.209645707581307,173.57090092238317,,0,0,0,173.57090092238317,60.711227197813294,,0,0,0,60.711227197813294,71.14468205989012,,0,0,0,71.14468205989012,114.89170272432567,,0,0,0,114.89170272432567
88,ALA,8.894242851565101,,0,0,0,8.894242851565101,5.301582878726829,,0,0,0,5.301582878726829,174.7093496114441,,0,0,0,174.7093496114441,50.42169347320457,,0,0,0,50.42169347320457,22.510409693434344,,0,0,0,22.510409693434344,126.35490286723277,,0,0,0,126.35490286723277
89,LYS,8.87372069020424,,0,0,0,8.87372069020424,5.199432203046952,,0,0,0,5.199432203046952,174.7063621571484,,0,0,0,174.7063621571484,54.77419291976357,,0,0,0,54.77419291976357,35.60406002881008,,0,0,0,35.60406002881008,121.96522752506382,,0,0,0,121.96522752506382