RESNUM,RESNAME,H_X,H_Y,H_BEST_REF_SCORE,H_BEST_REF_COV,H_BEST_REF_MATCH,H_UCBShift,HA_X,HA_Y,HA_BEST_REF_SCORE,HA_BEST_REF_COV,HA_BEST_REF_MATCH,HA_UCBShift,C_X,C_Y,C_BEST_REF_SCORE,C_BEST_REF_COV,C_BEST_REF_MATCH,C_UCBShift,CA_X,CA_Y,CA_BEST_REF_SCORE,CA_BEST_REF_COV,CA_BEST_REF_MATCH,CA_UCBShift,CB_X,CB_Y,CB_BEST_REF_SCORE,CB_BEST_REF_COV,CB_BEST_REF_MATCH,CB_UCBShift,N_X,N_Y,N_BEST_REF_SCORE,N_BEST_REF_COV,N_BEST_REF_MATCH,N_UCBShift
1,SER,8.439438573348873,,0,0,0,8.439438573348873,4.398978898817848,,0,0,0,4.398978898817848,174.17196852267176,,0,0,0,174.17196852267176,58.05992348462093,,0,0,0,58.05992348462093,63.81478817700077,,0,0,0,63.81478817700077,117.13440795287491,,0,0,0,117.13440795287491
2,LYS,8.502782602852703,,0,0,0,8.502782602852703,4.41878458992119,,0,0,0,4.41878458992119,176.7564557964702,,0,0,0,176.7564557964702,55.868240040836945,,0,0,0,55.868240040836945,33.50581928607504,,0,0,0,33.50581928607504,123.1023081930181,,0,0,0,123.1023081930181
3,LEU,8.451287277899878,,0,0,0,8.451287277899878,4.5116648547397045,,0,0,0,4.5116648547397045,175.11922064751914,,0,0,0,175.11922064751914,53.10097213893329,,0,0,0,53.10097213893329,41.22132037448663,,0,0,0,41.22132037448663,122.83006337647352,,0,0,0,122.83006337647352
4,PRO,,,0,0,0,,4.721492692488068,,0,0,0,4.721492692488068,170.78294720755355,,0,0,0,170.78294720755355,61.588122651481854,,0,0,0,61.588122651481854,31.192326055300253,,0,0,0,31.192326055300253,,,0,0,0,
5,PRO,,,0,0,0,,4.348478447086247,,0,0,0,4.348478447086247,178.12036036797647,,0,0,0,178.12036036797647,64.32574511894772,,0,0,0,64.32574511894772,31.62096999922855,,0,0,0,31.62096999922855,,,0,0,0,
6,GLY,8.61958686905872,,0,0,0,8.61958686905872,3.513325929717505,,0,0,0,3.513325929717505,173.40071347010766,,0,0,0,173.40071347010766,45.23714925894106,,0,0,0,45.23714925894106,,,0,0,0,,110.37703928175713,,0,0,0,110.37703928175713
7,TRP,8.053656103785103,,0,0,0,8.053656103785103,4.95123300964036,,0,0,0,4.95123300964036,176.43314413989899,,0,0,0,176.43314413989899,57.44731989012099,,0,0,0,57.44731989012099,30.88090316750472,,0,0,0,30.88090316750472,120.6497072003552,,0,0,0,120.6497072003552
8,GLU,9.346694453823954,,0,0,0,9.346694453823954,4.899861821095571,,0,0,0,4.899861821095571,175.31693512756132,,0,0,0,175.31693512756132,54.41522582375402,,0,0,0,54.41522582375402,33.38808917318792,,0,0,0,33.38808917318792,122.16446030498946,,0,0,0,122.16446030498946
9,LYS,8.832618225774224,,0,0,0,8.832618225774224,4.369091277600178,,0,0,0,4.369091277600178,175.86826113432122,,0,0,0,175.86826113432122,56.192573282645135,,0,0,0,56.192573282645135,33.140761551631705,,0,0,0,33.140761551631705,125.58250394888447,,0,0,0,125.58250394888447
10,ARG,8.69522897968143,,0,0,0,8.69522897968143,4.520752910128761,,0,0,0,4.520752910128761,173.9718257227051,,0,0,0,173.9718257227051,54.43202366081696,,0,0,0,54.43202366081696,32.78562897970363,,0,0,0,32.78562897970363,126.37965421258185,,0,0,0,126.37965421258185
11,MET,8.773093237040737,,0,0,0,8.773093237040737,4.929143532733932,,0,0,0,4.929143532733932,176.00607427061274,,0,0,0,176.00607427061274,54.46968901032856,,0,0,0,54.46968901032856,34.0906907981463,,0,0,0,34.0906907981463,121.30988337407592,,0,0,0,121.30988337407592
12,SER,8.93988153938839,,0,0,0,8.93988153938839,4.579448666955267,,0,0,0,4.579448666955267,175.67471862973693,,0,0,0,175.67471862973693,57.92035048184593,,0,0,0,57.92035048184593,64.27552850200355,,0,0,0,64.27552850200355,121.20274416254857,,0,0,0,121.20274416254857
13,ARG,8.800158107292708,,0,0,0,8.800158107292708,4.161831679193029,,0,0,0,4.161831679193029,177.11476812658455,,0,0,0,177.11476812658455,57.88863829597624,,0,0,0,57.88863829597624,29.960723526379176,,0,0,0,29.960723526379176,127.92082943656344,,0,0,0,127.92082943656344
14,ASN,8.326681964174714,,0,0,0,8.326681964174714,4.662828882362083,,0,0,0,4.662828882362083,176.54793363456542,,0,0,0,176.54793363456542,54.75893416870907,,0,0,0,54.75893416870907,38.551750324864024,,0,0,0,38.551750324864024,115.59474016584527,,0,0,0,115.59474016584527
15,SER,7.950062446309246,,0,0,0,7.950062446309246,4.51186955987901,,0,0,0,4.51186955987901,175.40315904824618,,0,0,0,175.40315904824618,58.677618858502605,,0,0,0,58.677618858502605,64.9671283376124,,0,0,0,64.9671283376124,113.24038590543901,,0,0,0,113.24038590543901
16,GLY,8.231853345815296,,0,0,0,8.231853345815296,3.9539161186230443,,0,0,0,3.9539161186230443,174.00055467896547,,0,0,0,174.00055467896547,46.19406217254967,,0,0,0,46.19406217254967,,,0,0,0,,112.42389983813963,,0,0,0,112.42389983813963
17,ARG,7.984200690659341,,0,0,0,7.984200690659341,4.529499699439449,,0,0,0,4.529499699439449,175.85735552664005,,0,0,0,175.85735552664005,55.674122764141416,,0,0,0,55.674122764141416,31.514093784443332,,0,0,0,31.514093784443332,120.64639368743478,,0,0,0,120.64639368743478
18,VAL,8.308869048634698,,0,0,0,8.308869048634698,4.74206219016539,,0,0,0,4.74206219016539,175.74331458596404,,0,0,0,175.74331458596404,62.45826137748363,,0,0,0,62.45826137748363,32.37963233765124,,0,0,0,32.37963233765124,122.31012682816073,,0,0,0,122.31012682816073
19,TYR,8.756453813741812,,0,0,0,8.756453813741812,5.041416397136198,,0,0,0,5.041416397136198,172.62860726657232,,0,0,0,172.62860726657232,55.71985887484182,,0,0,0,55.71985887484182,41.16000512410922,,0,0,0,41.16000512410922,123.72757126517926,,0,0,0,123.72757126517926
20,TYR,9.172672940581641,,0,0,0,9.172672940581641,5.3488768021201025,,0,0,0,5.3488768021201025,175.0460359239927,,0,0,0,175.0460359239927,56.472777083977135,,0,0,0,56.472777083977135,41.0249619549173,,0,0,0,41.0249619549173,118.14455542032412,,0,0,0,118.14455542032412
21,PHE,9.663459054761905,,0,0,0,9.663459054761905,5.3560331593517585,,0,0,0,5.3560331593517585,173.8764982137529,,0,0,0,173.8764982137529,55.75796798707959,,0,0,0,55.75796798707959,42.71681550017205,,0,0,0,42.71681550017205,124.26853531489621,,0,0,0,124.26853531489621
22,ASN,8.340370414246864,,0,0,0,8.340370414246864,4.853618561760462,,0,0,0,4.853618561760462,176.6105591695582,,0,0,0,176.6105591695582,51.19029789288489,,0,0,0,51.19029789288489,37.98563981686092,,0,0,0,37.98563981686092,125.87771487368187,,0,0,0,125.87771487368187
23,HIS,8.752176730197581,,0,0,0,8.752176730197581,4.217958690703741,,0,0,0,4.217958690703741,176.00967632768342,,0,0,0,176.00967632768342,57.48261404103119,,0,0,0,57.48261404103119,29.741618057209458,,0,0,0,29.741618057209458,123.03966812276613,,0,0,0,123.03966812276613
24,ILE,7.873998817920968,,0,0,0,7.873998817920968,3.967581528321679,,0,0,0,3.967581528321679,177.57755859928406,,0,0,0,177.57755859928406,63.168348432334334,,0,0,0,63.168348432334334,37.5938828085248,,0,0,0,37.5938828085248,120.03039671353646,,0,0,0,120.03039671353646
25,THR,7.5062216640914645,,0,0,0,7.5062216640914645,4.320687062820513,,0,0,0,4.320687062820513,175.2932642119103,,0,0,0,175.2932642119103,61.40945364647019,,0,0,0,61.40945364647019,70.01142949043734,,0,0,0,70.01142949043734,107.52424116873127,,0,0,0,107.52424116873127
26,ASN,7.876793950754802,,0,0,0,7.876793950754802,4.204900132384283,,0,0,0,4.204900132384283,173.8940513246753,,0,0,0,173.8940513246753,54.58158929928405,,0,0,0,54.58158929928405,37.56554765285825,,0,0,0,37.56554765285825,117.5424203485792,,0,0,0,117.5424203485792
27,ALA,7.156119570695971,,0,0,0,7.156119570695971,4.550631948051948,,0,0,0,4.550631948051948,176.0513441500777,,0,0,0,176.0513441500777,51.51165710286935,,0,0,0,51.51165710286935,20.728257902725055,,0,0,0,20.728257902725055,122.13825861683871,,0,0,0,122.13825861683871
28,SER,8.524417935142635,,0,0,0,8.524417935142635,5.636361693722943,,0,0,0,5.636361693722943,173.14897082354312,,0,0,0,173.14897082354312,57.096722625974024,,0,0,0,57.096722625974024,65.67092407881563,,0,0,0,65.67092407881563,115.44760648596404,,0,0,0,115.44760648596404
29,GLN,8.942164595232544,,0,0,0,8.942164595232544,4.631806052380953,,0,0,0,4.631806052380953,175.44884633359973,,0,0,0,175.44884633359973,54.944828672261075,,0,0,0,54.944828672261075,31.977097498767897,,0,0,0,31.977097498767897,121.12297153171272,,0,0,0,121.12297153171272
30,PHE,8.825121654517705,,0,0,0,8.825121654517705,4.529887020673771,,0,0,0,4.529887020673771,176.27951316999113,,0,0,0,176.27951316999113,58.96348900561661,,0,0,0,58.96348900561661,39.58949100500055,,0,0,0,39.58949100500055,121.63940849960595,,0,0,0,121.63940849960595
31,GLU,8.312951485175935,,0,0,0,8.312951485175935,4.445196973762348,,0,0,0,4.445196973762348,176.91261716476856,,0,0,0,176.91261716476856,56.07770104043734,,0,0,0,56.07770104043734,30.698228225041625,,0,0,0,30.698228225041625,119.06638952650128,,0,0,0,119.06638952650128
32,ARG,8.443797067798867,,0,0,0,8.443797067798867,3.438258533663558,,0,0,0,3.438258533663558,174.60897908595294,,0,0,0,174.60897908595294,54.32743832825508,,0,0,0,54.32743832825508,30.025689328399377,,0,0,0,30.025689328399377,124.94850353153512,,0,0,0,124.94850353153512
33,PRO,,,0,0,0,,3.9861911515096025,,0,0,0,3.9861911515096025,176.14669202448664,,0,0,0,176.14669202448664,62.717871263497614,,0,0,0,62.717871263497614,31.186738507958708,,0,0,0,31.186738507958708,,,0,0,0,
34,SER,8.061813875219226,,0,0,0,8.061813875219226,4.35952324019314,,0,0,0,4.35952324019314,174.8006881633311,,0,0,0,174.8006881633311,58.27802325937395,,0,0,0,58.27802325937395,63.82571071525141,,0,0,0,63.82571071525141,117.34732021536242,,0,0,0,117.34732021536242
35,GLY,8.135066518797869,,0,0,0,8.135066518797869,3.8594233611027864,,0,0,0,3.8594233611027864,176.16690410659342,,0,0,0,176.16690410659342,45.73716250490065,,0,0,0,45.73716250490065,,,0,0,0,,113.28614361890887,,0,0,0,113.28614361890887
