RESNUM,RESNAME,H_X,H_Y,H_BEST_REF_SCORE,H_BEST_REF_COV,H_BEST_REF_MATCH,H_UCBShift,HA_X,HA_Y,HA_BEST_REF_SCORE,HA_BEST_REF_COV,HA_BEST_REF_MATCH,HA_UCBShift,C_X,C_Y,C_BEST_REF_SCORE,C_BEST_REF_COV,C_BEST_REF_MATCH,C_UCBShift,CA_X,CA_Y,CA_BEST_REF_SCORE,CA_BEST_REF_COV,CA_BEST_REF_MATCH,CA_UCBShift,CB_X,CB_Y,CB_BEST_REF_SCORE,CB_BEST_REF_COV,CB_BEST_REF_MATCH,CB_UCBShift,N_X,N_Y,N_BEST_REF_SCORE,N_BEST_REF_COV,N_BEST_REF_MATCH,N_UCBShift
1,MET,8.348440032989233,8.01,0.43738611855301834,0.8816568047337278,1,8.088129551443,4.358800218636919,,0,0,0,4.358800218636919,174.41739350413476,,0,0,0,174.41739350413476,55.34128526253191,,0,0,0,55.34128526253191,33.36373567827173,,0,0,0,33.36373567827173,120.52609264086469,119.79,0.43738611855301834,0.8816568047337278,1,120.23814853946608
2,THR,8.41293871000666,8.67,0.43738611855301834,0.8816568047337278,1,8.681377132206682,4.3917859747308245,,0,0,0,4.3917859747308245,173.1670616978355,,0,0,0,173.1670616978355,61.7028623048729,,0,0,0,61.7028623048729,70.2949041639749,,0,0,0,70.2949041639749,120.06781957931513,122.57,0.43738611855301834,0.8816568047337278,1,122.68350394965034
3,GLU,8.560288043295593,8.35,0.43738611855301834,0.8816568047337278,1,8.396640118648019,5.08603922988678,,0,0,0,5.08603922988678,175.6515320438839,,0,0,0,175.6515320438839,55.3802382038628,,0,0,0,55.3802382038628,31.73855683091908,,0,0,0,31.73855683091908,127.6053568044178,126.85,0.43738611855301834,0.8816568047337278,1,127.16233911669997
4,TYR,9.202790952725053,8.74,0.43738611855301834,0.8816568047337278,1,8.828278823670773,5.087609038067488,,0,0,0,5.087609038067488,174.6280507915751,,0,0,0,174.6280507915751,56.511161375629925,,0,0,0,56.511161375629925,40.320073594688644,,0,0,0,40.320073594688644,124.60655425420136,121.83,0.43738611855301834,0.8816568047337278,1,122.30380810733156
5,LYS,9.157407735769786,9.15,0.43738611855301834,0.8816568047337278,1,9.167915688356088,4.9631060000777,,0,0,0,4.9631060000777,175.84855549655344,,0,0,0,175.84855549655344,55.549416451825955,,0,0,0,55.549416451825955,32.87526827691753,,0,0,0,32.87526827691753,124.72144677075147,124.42,0.43738611855301834,0.8816568047337278,1,124.61312578182928
6,LEU,9.133211340287492,9.47,0.43738611855301834,0.8816568047337278,1,9.480215297868797,5.160502244633145,,0,0,0,5.160502244633145,175.5600789753302,,0,0,0,175.5600789753302,53.1906696942946,,0,0,0,53.1906696942946,44.00379250316905,,0,0,0,44.00379250316905,126.26019165833056,126.53,0.43738611855301834,0.8816568047337278,1,126.74294736642801
7,VAL,8.826195273415474,7.94,0.43738611855301834,0.8816568047337278,1,8.134883021578421,4.700252690298591,,0,0,0,4.700252690298591,174.545499015207,,0,0,0,174.545499015207,60.706870011643915,,0,0,0,60.706870011643915,35.19414356540681,,0,0,0,35.19414356540681,121.91902888189588,120.55,0.43738611855301834,0.8816568047337278,1,120.8866468088467
8,VAL,8.74584242045732,9.01,0.43738611855301834,0.8816568047337278,1,9.003471644921744,4.513125111799312,,0,0,0,4.513125111799312,174.79019206698302,,0,0,0,174.79019206698302,61.86672645754246,,0,0,0,61.86672645754246,32.059157026085025,,0,0,0,32.059157026085025,127.41195646132202,129.04,0.43738611855301834,0.8816568047337278,1,129.03879597107894
9,VAL,9.149274798673549,9.15,0.43738611855301834,0.8816568047337278,1,9.200881187357087,4.683008231857031,,0,0,0,4.683008231857031,174.02574453332778,,0,0,0,174.02574453332778,58.63814642417582,,0,0,0,58.63814642417582,34.7476630469808,,0,0,0,34.7476630469808,118.8663771493229,120.37,0.43738611855301834,0.8816568047337278,1,120.67185080919636
10,GLY,6.79194446172161,7.12,0.43738611855301834,0.8816568047337278,1,7.2329187570374085,3.8965568821595067,,0,0,0,3.8965568821595067,173.11723996259298,,0,0,0,173.11723996259298,44.204496905233654,,0,0,0,44.204496905233654,,,0,0,0,,108.37544956917527,107.42,0.43738611855301834,0.8816568047337278,1,107.92630966923076
11,ALA,8.378340504173604,9.21,0.43738611855301834,0.8816568047337278,1,9.103178598362748,4.414511658838384,,0,0,0,4.414511658838384,177.60510868937175,,0,0,0,177.60510868937175,52.663983415012765,,0,0,0,52.663983415012765,19.363777143828397,,0,0,0,19.363777143828397,122.45850190709845,123.66,0.43738611855301834,0.8816568047337278,1,123.73118181463536
12,GLY,8.524167843889444,8.62,0.43738611855301834,0.8816568047337278,1,8.619438869624819,3.876567361921412,,0,0,0,3.876567361921412,175.62135783861694,,0,0,0,175.62135783861694,46.71865433394939,,0,0,0,46.71865433394939,,,0,0,0,,107.1560477025308,106.23,0.43738611855301834,0.8816568047337278,1,106.73535776443556
13,GLY,8.61011187065712,10.57,0.43738611855301834,0.8816568047337278,1,10.408320785298034,3.705872338691864,,0,0,0,3.705872338691864,174.04084238074702,,0,0,0,174.04084238074702,46.17671382975358,,0,0,0,46.17671382975358,,,0,0,0,,110.57707973221223,115.06,0.43738611855301834,0.8816568047337278,1,114.95720282258853
14,VAL,7.722199619264069,7.67,0.43738611855301834,0.8816568047337278,1,7.680274019214118,4.025013669524919,,0,0,0,4.025013669524919,175.2927555459818,,0,0,0,175.2927555459818,63.29873459203019,,0,0,0,63.29873459203019,32.56554992056832,,0,0,0,32.56554992056832,114.83633865349096,113.3,0.43738611855301834,0.8816568047337278,1,113.7744727513986
15,GLY,8.552398252769454,8.57,0.43738611855301834,0.8816568047337278,1,8.602680461688312,4.319698446492397,,0,0,0,4.319698446492397,174.71891958826728,,0,0,0,174.71891958826728,45.96796427956488,,0,0,0,45.96796427956488,,,0,0,0,,109.41539573339993,109.32,0.43738611855301834,0.8816568047337278,1,109.67629019993339
16,LYS,9.01489572048507,10.57,0.43738611855301834,0.8816568047337278,1,10.198015841003437,3.778834196156621,,0,0,0,3.778834196156621,178.1651335417083,,0,0,0,178.1651335417083,60.32128916408592,,0,0,0,60.32128916408592,31.012836709829063,,0,0,0,31.012836709829063,122.73205491694972,125.31,0.43738611855301834,0.8816568047337278,1,125.08300362266068
17,SER,8.716881995243645,9.29,0.43738611855301834,0.8816568047337278,1,9.293787723509823,4.226006369175269,,0,0,0,4.226006369175269,176.16011953751803,,0,0,0,176.16011953751803,61.42634316595627,,0,0,0,61.42634316595627,62.60575174005994,,0,0,0,62.60575174005994,115.25700761605617,120.34,0.43738611855301834,0.8816568047337278,1,119.33627461201021
18,ALA,8.157958615922967,9.59,0.43738611855301834,0.8816568047337278,1,9.38254412948163,3.9975249885864135,,0,0,0,3.9975249885864135,179.98160930322456,,0,0,0,179.98160930322456,54.996401578255075,,0,0,0,54.996401578255075,18.589533855694306,,0,0,0,18.589533855694306,124.59755339967255,125.31,0.43738611855301834,0.8816568047337278,1,125.58921984042624
19,LEU,8.683280913547563,9.01,0.43738611855301834,0.8816568047337278,1,9.028320032783883,4.0419155794427795,,0,0,0,4.0419155794427795,178.817572862876,,0,0,0,178.817572862876,58.125755740836944,,0,0,0,58.125755740836944,42.76590397227217,,0,0,0,42.76590397227217,119.89370114614275,120.25,0.43738611855301834,0.8816568047337278,1,120.26695561889777
20,THR,8.415374996081697,7.66,0.43738611855301834,0.8816568047337278,1,7.906996203596404,3.663725913572538,,0,0,0,3.663725913572538,175.7395180750638,,0,0,0,175.7395180750638,67.68644610303585,,0,0,0,67.68644610303585,68.13233235008325,,0,0,0,68.13233235008325,117.42744480046065,116.81,0.43738611855301834,0.8816568047337278,1,117.46505028394382
21,ILE,8.717733276689977,8.87,0.43738611855301834,0.8816568047337278,1,8.862094156732157,3.2547305362581858,,0,0,0,3.2547305362581858,177.80108445054947,,0,0,0,177.80108445054947,65.56071759595406,,0,0,0,65.56071759595406,37.7639083012432,,0,0,0,37.7639083012432,122.53757745745366,120.36,0.43738611855301834,0.8816568047337278,1,121.10674442354313
22,GLN,8.269077345815296,7.83,0.43738611855301834,0.8816568047337278,1,7.904122983821734,4.11123824050949,,0,0,0,4.11123824050949,177.85105792097346,,0,0,0,177.85105792097346,58.45768646496837,,0,0,0,58.45768646496837,28.2387425991009,,0,0,0,28.2387425991009,120.70287234741369,120.96,0.43738611855301834,0.8816568047337278,1,121.04317139344543
23,LEU,8.11919105964591,7.6,0.43738611855301834,0.8816568047337278,1,7.762641517771118,3.9242277405372405,,0,0,0,3.9242277405372405,178.4880381492119,,0,0,0,178.4880381492119,58.511685201531805,,0,0,0,58.511685201531805,41.44322937918748,,0,0,0,41.44322937918748,121.73691481671662,120.37,0.43738611855301834,0.8816568047337278,1,120.81714468499278
24,ILE,8.433211684637584,8.14,0.43738611855301834,0.8816568047337278,1,8.207649686086137,3.5661743473748473,,0,0,0,3.5661743473748473,177.82753957445334,,0,0,0,177.82753957445334,63.61445168938284,,0,0,0,63.61445168938284,37.310389485747585,,0,0,0,37.310389485747585,119.42651905910756,114.05,0.43738611855301834,0.8816568047337278,1,115.24513274545455
25,GLN,8.130093617410367,8.97,0.43738611855301834,0.8816568047337278,1,8.933394205522257,4.386304980386281,,0,0,0,4.386304980386281,176.11035270719836,,0,0,0,176.11035270719836,55.48153587333223,,0,0,0,55.48153587333223,30.101758638167386,,0,0,0,30.101758638167386,115.42108015235874,115.75,0.43738611855301834,0.8816568047337278,1,116.15357823745144
26,ASN,7.812533899994449,7.91,0.43738611855301834,0.8816568047337278,1,7.90775294971695,4.418185149619825,,0,0,0,4.418185149619825,174.16334827267175,,0,0,0,174.16334827267175,53.87075764197469,,0,0,0,53.87075764197469,37.54523137609058,,0,0,0,37.54523137609058,117.88144693231769,116.46,0.43738611855301834,0.8816568047337278,1,116.70050250101565
27,HIS,7.908326614368964,6.73,0.43738611855301834,0.8816568047337278,1,6.842798286935286,4.6334822100177595,,0,0,0,4.6334822100177595,173.9616651026751,,0,0,0,173.9616651026751,55.282571464779664,,0,0,0,55.282571464779664,31.326619160384062,,0,0,0,31.326619160384062,116.88152736405817,110.76,0.43738611855301834,0.8816568047337278,1,112.40298266741591
28,PHE,8.444531013963815,8.59,0.43738611855301834,0.8816568047337278,1,8.607898393389943,4.666570039599289,,0,0,0,4.666570039599289,174.2576208392663,,0,0,0,174.2576208392663,57.17403054738595,,0,0,0,57.17403054738595,39.908297212154515,,0,0,0,39.908297212154515,123.94791523419913,122.3,0.43738611855301834,0.8816568047337278,1,123.05886180978466
29,VAL,7.696237215084914,7.75,0.43738611855301834,0.8816568047337278,1,7.75836204060384,3.7847416899822393,,0,0,0,3.7847416899822393,175.10065139099234,,0,0,0,175.10065139099234,61.65768600692641,,0,0,0,61.65768600692641,32.594124666661116,,0,0,0,32.594124666661116,126.31331656631147,125.6,0.43738611855301834,0.8816568047337278,1,126.14012482339882
30,ASP,8.174310065673216,7.92,0.43738611855301834,0.8816568047337278,1,7.9486005961593955,4.359111627283827,,0,0,0,4.359111627283827,176.1928217365579,,0,0,0,176.1928217365579,54.6143319468698,,0,0,0,54.6143319468698,41.13718442596293,,0,0,0,41.13718442596293,125.78275191608392,122.13,0.43738611855301834,0.8816568047337278,1,123.43379294090354
31,GLU,8.067524482162282,7.7,0.43738611855301834,0.8816568047337278,1,7.743146307647907,4.287252924889,,0,0,0,4.287252924889,175.7595224202353,,0,0,0,175.7595224202353,56.42420677953713,,0,0,0,56.42420677953713,30.03828833145188,,0,0,0,30.03828833145188,119.5512156036075,,0.0,0.0,0,119.5512156036075
32,TYR,8.396257319097568,8.879999999999999,0.43738611855301834,0.8816568047337278,0,8.796494104700853,4.503622572666223,,0,0,0,4.503622572666223,174.69574336173272,,0,0,0,174.69574336173272,57.693069325524476,,0,0,0,57.693069325524476,38.63984025444,,0,0,0,38.63984025444,123.6527630056832,125.8,0.43738611855301834,0.8816568047337278,0,126.00012987673438
33,ASP,8.087985685536687,7.760000000000001,0.43738611855301834,0.8816568047337278,1,7.775780782806083,4.7521671387945394,,0,0,0,4.7521671387945394,174.17992178328893,,0,0,0,174.17992178328893,50.98913401836497,,0,0,0,50.98913401836497,42.021295215057165,,0,0,0,42.021295215057165,126.77249414180265,131.08,0.43738611855301834,0.8816568047337278,1,130.95971657836054
34,PRO,,,0.0,0.0,0,,3.987459552583528,,0,0,0,3.987459552583528,176.48291852597958,,0,0,0,176.48291852597958,62.77503999978355,,0,0,0,62.77503999978355,31.581570420540572,,0,0,0,31.581570420540572,,,0.0,0.0,0,
35,THR,8.059539662515263,9.02,0.43738611855301834,0.8816568047337278,1,8.995323317044068,4.2422317125652125,,0,0,0,4.2422317125652125,174.47582468135752,,0,0,0,174.47582468135752,62.48685552201687,,0,0,0,62.48685552201687,69.89635690641025,,0,0,0,69.89635690641025,116.44859007769452,109.34,0.43738611855301834,0.8816568047337278,1,110.30099098484293
36,ILE,8.245968648340549,6.92,0.43738611855301834,0.8816568047337278,1,7.226939715412366,3.7859363110972355,,0,0,0,3.7859363110972355,175.58270310412922,,0,0,0,175.58270310412922,62.481418132672886,,0,0,0,62.481418132672886,38.440528026462424,,0,0,0,38.440528026462424,123.05038324796315,120.67,0.43738611855301834,0.8816568047337278,1,121.03509859206349
37,GLU,7.831631767227217,8.52,0.43738611855301834,0.8816568047337278,1,8.480740548196248,5.1855008998556995,,0,0,0,5.1855008998556995,174.8482038435509,,0,0,0,174.8482038435509,55.35665956634477,,0,0,0,55.35665956634477,32.27675554275724,,0,0,0,32.27675554275724,119.52162233537574,133.86,0.43738611855301834,0.8816568047337278,1,125.31174486661672
38,ASP,8.843652466927518,8.18,0.43738611855301834,0.8816568047337278,1,8.349975064618715,4.902293947990898,,0,0,0,4.902293947990898,174.01083718856145,,0,0,0,174.01083718856145,53.390915646669995,,0,0,0,53.390915646669995,44.712636602314355,,0,0,0,44.712636602314355,125.22460446849817,123.73,0.43738611855301834,0.8816568047337278,1,124.2220372918526
39,SER,8.447185756560106,8.5,0.43738611855301834,0.8816568047337278,1,8.489056914696416,5.174512032867132,,0,0,0,5.174512032867132,173.4332685294372,,0,0,0,173.4332685294372,56.880496819708064,,0,0,0,56.880496819708064,64.30559043274503,,0,0,0,64.30559043274503,117.80910076797647,114.52,0.43738611855301834,0.8816568047337278,1,115.12267653904429
40,TYR,9.19932979955045,9.13,0.43738611855301834,0.8816568047337278,1,9.169159973026971,4.752172996753247,,0,0,0,4.752172996753247,174.4303057947053,,0,0,0,174.4303057947053,57.15855345463425,,0,0,0,57.15855345463425,42.31253425301365,,0,0,0,42.31253425301365,123.96943537662337,122.08,0.43738611855301834,0.8816568047337278,1,122.50362002225552
41,ARG,8.541103604639805,8.41,0.43738611855301834,0.8816568047337278,1,8.432079798523699,5.161407834804085,,0,0,0,5.161407834804085,175.59117527034633,,0,0,0,175.59117527034633,54.707304037695636,,0,0,0,54.707304037695636,33.0363953512987,,0,0,0,33.0363953512987,121.83113547253858,120.5,0.43738611855301834,0.8816568047337278,1,120.7811020958153
42,LYS,8.8333599510101,8.57,0.43738611855301834,0.8816568047337278,1,8.638097550083248,4.690249749650349,,0,0,0,4.690249749650349,174.80824322666223,,0,0,0,174.80824322666223,55.17198211535132,,0,0,0,55.17198211535132,36.188578297713406,,0,0,0,36.188578297713406,123.20062849663115,121.5,0.43738611855301834,0.8816568047337278,1,121.69531718181264
43,GLN,8.668482622305472,8.82,0.43738611855301834,0.8816568047337278,1,8.824259051531802,5.069875812265512,,0,0,0,5.069875812265512,175.36029310870796,,0,0,0,175.36029310870796,55.44410421234876,,0,0,0,55.44410421234876,29.59780940190365,,0,0,0,29.59780940190365,127.02014612758353,128.82,0.43738611855301834,0.8816568047337278,1,129.05262694907867
44,VAL,9.00975830914641,9.1,0.43738611855301834,0.8816568047337278,1,9.134516395937396,4.476579398235098,,0,0,0,4.476579398235098,173.8276267921412,,0,0,0,173.8276267921412,59.660176716977475,,0,0,0,59.660176716977475,35.17127572363192,,0,0,0,35.17127572363192,119.83404973931624,121.52,0.43738611855301834,0.8816568047337278,1,121.53831942556889
45,VAL,8.328741545532246,8.05,0.43738611855301834,0.8816568047337278,1,8.107243146003995,4.720649411094461,,0,0,0,4.720649411094461,175.8779553410645,,0,0,0,175.8779553410645,61.302138521195474,,0,0,0,61.302138521195474,32.55079009141414,,0,0,0,32.55079009141414,122.40565337042402,121.53,0.43738611855301834,0.8816568047337278,1,121.8360476449939
46,ILE,8.978817658641358,8.26,0.43738611855301834,0.8816568047337278,1,8.418925093989344,4.121137913958264,,0,0,0,4.121137913958264,175.47841948017538,,0,0,0,175.47841948017538,60.203995010667114,,0,0,0,60.203995010667114,39.79041107182817,,0,0,0,39.79041107182817,127.82777452682318,125.64,0.43738611855301834,0.8816568047337278,1,126.28491434132535
47,ASP,9.466927303796204,9.59,0.43738611855301834,0.8816568047337278,1,9.562884959240758,4.2680004489288486,,0,0,0,4.2680004489288486,175.8205836441725,,0,0,0,175.8205836441725,55.47341350742591,,0,0,0,55.47341350742591,40.18595652095127,,0,0,0,40.18595652095127,128.32172358721834,130.48,0.43738611855301834,0.8816568047337278,1,130.27934040220336
48,GLY,8.474877455677655,8.3,0.43738611855301834,0.8816568047337278,1,8.339896435692086,3.8385854413114666,,0,0,0,3.8385854413114666,173.87638928697413,,0,0,0,173.87638928697413,45.45098215607726,,0,0,0,45.45098215607726,,,0,0,0,,103.7457589001554,103.38,0.43738611855301834,0.8816568047337278,1,103.58043141265401
49,GLU,7.9996833262126765,7.68,0.43738611855301834,0.8816568047337278,1,7.708264822005772,4.486758841752692,,0,0,0,4.486758841752692,175.3701265459263,,0,0,0,175.3701265459263,54.77739252408147,,0,0,0,54.77739252408147,31.526153415362415,,0,0,0,31.526153415362415,121.11949823740704,122.72,0.43738611855301834,0.8816568047337278,1,122.78754772269397
50,THR,8.630534470152071,9.0,0.43738611855301834,0.8816568047337278,1,9.027778772027972,5.094648461116661,,0,0,0,5.094648461116661,174.1768322167721,,0,0,0,174.1768322167721,62.44454088589188,,0,0,0,62.44454088589188,69.43554689086469,,0,0,0,69.43554689086469,119.76799819079254,126.13,0.43738611855301834,0.8816568047337278,1,125.03393434131978
51,CYS,9.093165996875348,9.39,0.43738611855301834,0.8816568047337278,1,9.41922543959929,5.254695524864024,,0,0,0,5.254695524864024,171.6644622464036,,0,0,0,171.6644622464036,56.33635680724276,,0,0,0,56.33635680724276,32.22770367642358,,0,0,0,32.22770367642358,123.11215213937729,124.66,0.43738611855301834,0.8816568047337278,1,124.845103539899
52,LEU,9.00219403049728,8.79,0.43738611855301834,0.8816568047337278,1,8.843943214191365,4.8481655746864245,,0,0,0,4.8481655746864245,175.25433941978577,,0,0,0,175.25433941978577,53.421789923182374,,0,0,0,53.421789923182374,44.40491353907204,,0,0,0,44.40491353907204,123.25253166546231,122.37,0.43738611855301834,0.8816568047337278,1,122.68213113071927
53,LEU,9.295939265811965,9.02,0.43738611855301834,0.8816568047337278,1,9.057780791341992,5.01707797026307,,0,0,0,5.01707797026307,175.30418216386946,,0,0,0,175.30418216386946,54.30011036383061,,0,0,0,54.30011036383061,42.503574093434345,,0,0,0,42.503574093434345,126.44202013725163,123.61,0.43738611855301834,0.8816568047337278,1,124.58048044675324
54,ASP,9.041743906987456,8.65,0.43738611855301834,0.8816568047337278,1,8.725607324192474,5.3114926653235655,,0,0,0,5.3114926653235655,174.92368385381286,,0,0,0,174.92368385381286,53.08605843909979,,0,0,0,53.08605843909979,41.75918428136863,,0,0,0,41.75918428136863,124.49152793297813,125.31,0.43738611855301834,0.8816568047337278,1,125.42061109158065
55,ILE,9.245456372705071,9.18,0.43738611855301834,0.8816568047337278,1,9.256009553052504,4.895868257009657,,0,0,0,4.895868257009657,174.39893642813297,,0,0,0,174.39893642813297,60.100201044749696,,0,0,0,60.100201044749696,39.28709709651459,,0,0,0,39.28709709651459,124.94234557762239,123.78,0.43738611855301834,0.8816568047337278,1,124.27029498086914
56,LEU,9.192187692041292,8.8,0.43738611855301834,0.8816568047337278,1,8.855179891785992,5.095150205289155,,0,0,0,5.095150205289155,174.877946345338,,0,0,0,174.877946345338,53.44046243390498,,0,0,0,53.44046243390498,43.82414204125874,,0,0,0,43.82414204125874,129.48869873664668,127.82,0.43738611855301834,0.8816568047337278,1,128.43394058250638
57,ASP,9.149790404983905,8.57,0.43738611855301834,0.8816568047337278,1,8.686047271656122,5.002593021628371,,0,0,0,5.002593021628371,175.009706632906,,0,0,0,175.009706632906,53.55512970986791,,0,0,0,53.55512970986791,42.747845683727384,,0,0,0,42.747845683727384,128.6967823921523,129.29,0.43738611855301834,0.8816568047337278,1,129.7828578125652
58,THR,8.13829042036852,6.73,0.43738611855301834,0.8816568047337278,1,6.871074716677768,4.804838266955267,,0,0,0,4.804838266955267,173.32360358902207,,0,0,0,173.32360358902207,60.0352831995005,,0,0,0,60.0352831995005,71.24606523493729,,0,0,0,71.24606523493729,116.11445913280052,110.28,0.43738611855301834,0.8816568047337278,1,111.3217988118548
59,ALA,8.40692275039405,9.18,0.43738611855301834,0.8816568047337278,1,9.10358536101676,4.422803244577644,,0,0,0,4.422803244577644,178.09865743214564,,0,0,0,178.09865743214564,52.92848718078588,,0,0,0,52.92848718078588,19.38758443774559,,0,0,0,19.38758443774559,123.87577579079809,121.06,0.43738611855301834,0.8816568047337278,1,121.6918035023421
60,GLY,8.689906106460207,,0.0,0.0,0,8.689906106460207,4.127602562762239,,0,0,0,4.127602562762239,174.31193112663448,,0,0,0,174.31193112663448,45.32359587827728,,0,0,0,45.32359587827728,,,0,0,0,,108.44815088017538,,0.0,0.0,0,108.44815088017538
61,GLN,7.930638437296038,,0.0,0.0,0,7.930638437296038,4.486310950213675,,0,0,0,4.486310950213675,177.2050219934066,,0,0,0,177.2050219934066,55.180168233916085,,0,0,0,55.180168233916085,30.15426848927739,,0,0,0,30.15426848927739,119.07389368494839,,0.0,0.0,0,119.07389368494839
62,GLU,8.814961876839828,,0.0,0.0,0,8.814961876839828,4.188911922596848,,0,0,0,4.188911922596848,177.91388219588188,,0,0,0,177.91388219588188,58.8331738043623,,0,0,0,58.8331738043623,29.128491960106558,,0,0,0,29.128491960106558,121.83320777565768,,0.0,0.0,0,121.83320777565768
63,GLU,9.175507186946387,,0.0,0.0,0,9.175507186946387,4.014425418323343,,0,0,0,4.014425418323343,177.32681731421357,,0,0,0,177.32681731421357,58.91457376399711,,0,0,0,58.91457376399711,28.892062845687644,,0,0,0,28.892062845687644,119.35516446041736,,0.0,0.0,0,119.35516446041736
64,TYR,7.78784704980575,,0.0,0.0,0,7.78784704980575,4.673792547677323,,0,0,0,4.673792547677323,176.6371426413864,,0,0,0,176.6371426413864,58.37759873550893,,0,0,0,58.37759873550893,38.167009835581084,,0,0,0,38.167009835581084,118.07949557351537,,0.0,0.0,0,118.07949557351537
65,SER,8.150404583227884,,0.0,0.0,0,8.150404583227884,4.261578198870573,,0,0,0,4.261578198870573,176.42935512784993,,0,0,0,176.42935512784993,61.43842178565878,,0,0,0,61.43842178565878,62.89927958744033,,0,0,0,62.89927958744033,117.45542651208237,,0.0,0.0,0,117.45542651208237
66,ALA,8.240888592979243,,0.0,0.0,0,8.240888592979243,4.181427367488068,,0,0,0,4.181427367488068,178.425037788345,,0,0,0,178.425037788345,54.03392726383061,,0,0,0,54.03392726383061,18.427095075518928,,0,0,0,18.427095075518928,124.3144441987679,,0.0,0.0,0,124.3144441987679
67,MET,7.817769659990009,,0.0,0.0,0,7.817769659990009,4.427756718692419,,0,0,0,4.427756718692419,177.17764206055057,,0,0,0,177.17764206055057,56.04864172141192,,0,0,0,56.04864172141192,33.02718878749584,,0,0,0,33.02718878749584,114.51618444670885,,0.0,0.0,0,114.51618444670885
68,ARG,7.862460390231991,7.81,0.43738611855301834,0.8816568047337278,1,7.787055282917083,2.9568221593933837,,0,0,0,2.9568221593933837,177.40958900873017,,0,0,0,177.40958900873017,60.418494366133864,,0,0,0,60.418494366133864,30.013814817071818,,0,0,0,30.013814817071818,119.84216723284493,120.82,0.43738611855301834,0.8816568047337278,1,121.056937702775
69,ASP,8.272196742379842,8.08,0.43738611855301834,0.8816568047337278,1,8.111082082301031,4.248711647363748,,0,0,0,4.248711647363748,178.32433219932847,,0,0,0,178.32433219932847,57.14576506471307,,0,0,0,57.14576506471307,39.885611511299814,,0,0,0,39.885611511299814,117.97806738429904,118.33,0.43738611855301834,0.8816568047337278,1,118.60687673109669
70,GLN,7.6684811390609395,7.8,0.43738611855301834,0.8816568047337278,1,7.768892518109668,4.095901828721279,,0,0,0,4.095901828721279,178.51262627776669,,0,0,0,178.51262627776669,58.65804791820402,,0,0,0,58.65804791820402,28.541176057681206,,0,0,0,28.541176057681206,119.98911266062825,117.3,0.43738611855301834,0.8816568047337278,1,117.80291026912532