RESNUM,RESNAME,H_X,H_Y,H_BEST_REF_SCORE,H_BEST_REF_COV,H_BEST_REF_MATCH,H_UCBShift,HA_X,HA_Y,HA_BEST_REF_SCORE,HA_BEST_REF_COV,HA_BEST_REF_MATCH,HA_UCBShift,C_X,C_Y,C_BEST_REF_SCORE,C_BEST_REF_COV,C_BEST_REF_MATCH,C_UCBShift,CA_X,CA_Y,CA_BEST_REF_SCORE,CA_BEST_REF_COV,CA_BEST_REF_MATCH,CA_UCBShift,CB_X,CB_Y,CB_BEST_REF_SCORE,CB_BEST_REF_COV,CB_BEST_REF_MATCH,CB_UCBShift,N_X,N_Y,N_BEST_REF_SCORE,N_BEST_REF_COV,N_BEST_REF_MATCH,N_UCBShift
1,GLY,8.310060349073149,,0.0,0.0,0,8.310060349073149,4.049327492929293,,0.0,0.0,0,4.049327492929293,173.29003399395603,,0,0,0,173.29003399395603,44.31399242096792,,0.0,0.0,0,44.31399242096792,,,0.0,0.0,0,,109.95784223288378,,0.0,0.0,0,109.95784223288378
2,PRO,,,0.0,0.0,0,,4.425887662265512,,0.0,0.0,0,4.425887662265512,176.9734947940837,,0,0,0,176.9734947940837,62.95324567896548,,0.0,0.0,0,62.95324567896548,32.1185190979132,,0.0,0.0,0,32.1185190979132,,,0.0,0.0,0,
3,SER,8.4449731492008,,0.0,0.0,0,8.4449731492008,4.4447699637640135,,0.0,0.0,0,4.4447699637640135,174.71968657931512,,0,0,0,174.71968657931512,58.46214702761127,,0.0,0.0,0,58.46214702761127,63.2485594560717,,0.0,0.0,0,63.2485594560717,118.6728779502664,,0.0,0.0,0,118.6728779502664
4,GLN,8.197719610822512,,0.0,0.0,0,8.197719610822512,4.335016799614275,,0.0,0.0,0,4.335016799614275,175.7834556722555,,0,0,0,175.7834556722555,55.796863769536024,,0.0,0.0,0,55.796863769536024,29.12712790894106,,0.0,0.0,0,29.12712790894106,122.6728981556388,,0.0,0.0,0,122.6728981556388
5,ILE,8.412504623271174,,0.0,0.0,0,8.412504623271174,4.136717009390609,,0.0,0.0,0,4.136717009390609,174.7607287784438,,0,0,0,174.7607287784438,58.82793406262626,,0.0,0.0,0,58.82793406262626,38.56984484912865,,0.0,0.0,0,38.56984484912865,125.46635801304251,,0.0,0.0,0,125.46635801304251
6,PRO,,,0.0,0.0,0,,4.474585563236763,,0.0,0.0,0,4.474585563236763,177.56727866758243,,0,0,0,177.56727866758243,62.842815068054165,,0.0,0.0,0,62.842815068054165,32.49554012409258,,0.0,0.0,0,32.49554012409258,,,0.0,0.0,0,
7,ALA,8.757009262537462,,0.0,0.0,0,8.757009262537462,4.058406035248085,,0.0,0.0,0,4.058406035248085,179.54932550774782,,0,0,0,179.54932550774782,55.937596024120325,,0.0,0.0,0,55.937596024120325,18.092570570135422,,0.0,0.0,0,18.092570570135422,127.601542361322,,0.0,0.0,0,127.601542361322
8,SER,8.520489624553225,,0.0,0.0,0,8.520489624553225,4.227565415997891,,0.0,0.0,0,4.227565415997891,176.67766433524807,,0,0,0,176.67766433524807,61.14729038598068,,0.0,0.0,0,61.14729038598068,62.36535088424908,,0.0,0.0,0,62.36535088424908,112.6898888407648,,0.0,0.0,0,112.6898888407648
9,GLU,8.061660160700411,,0.0,0.0,0,8.061660160700411,4.346895339443889,,0.0,0.0,0,4.346895339443889,179.2250250939394,,0,0,0,179.2250250939394,59.079487168104116,,0.0,0.0,0,59.079487168104116,29.838156398729048,,0.0,0.0,0,29.838156398729048,122.29080794012654,,0.0,0.0,0,122.29080794012654
10,GLN,8.148981445160395,7.93,0.4399574754714055,0.88,1,7.949307911910313,4.158849533871684,,0.0,0.0,0,4.158849533871684,177.92028197602397,,0,0,0,177.92028197602397,58.49033629269065,58.64,0.4399574754714055,0.88,1,58.65152898359974,28.629843995809747,29.15,0.4399574754714055,0.88,1,29.142145584171384,118.68211791505716,119.06,0.4399574754714055,0.88,1,119.26743619361194
11,GLU,7.958032365567766,7.77954402901401,0.4399574754714055,0.88,1,7.770698651520702,4.187819197829948,4.41,0.4008191243713717,0.6224489795918368,1,4.388776957203907,176.66385230870242,,0,0,0,176.66385230870242,56.70756018920524,55.84469059111665,0.4399574754714055,0.88,1,55.9352573999556,30.202970862620713,30.03915319674031,0.4399574754714055,0.88,1,30.074297792518593,117.1906866977578,115.93868124299235,0.4399574754714055,0.88,1,116.31396245461761
12,THR,7.604934506271506,7.5,0.4399574754714055,0.88,1,7.512378983843934,4.173755918481518,4.02,0.4399574754714055,0.88,1,4.030823565628816,173.9393475151515,,0,0,0,173.9393475151515,64.31560072598512,64.85,0.4399574754714055,0.88,1,64.78590985220335,69.66033988878898,,0.0,0.0,0,69.66033988878898,117.47440475319125,117.54,0.4399574754714055,0.88,1,117.72125495285269
13,LEU,8.746886020873571,8.442622135085532,0.4399574754714055,0.88,1,8.493783523015873,4.957032380980132,4.76,0.4008191243713717,0.6224489795918368,1,4.820527772516373,176.89034273245642,,0,0,0,176.89034273245642,54.71889094127539,54.58514656210264,0.4399574754714055,0.88,1,54.52330560573316,43.228016225302476,43.082980398003095,0.4399574754714055,0.88,1,43.186783250782554,128.65492452862136,127.15636761104187,0.4399574754714055,0.88,1,127.67015647794982
14,VAL,9.290765246803195,9.762622135085534,0.4399574754714055,0.88,1,9.772165756404707,5.174476316061716,4.81,0.4008191243713717,0.6224489795918368,1,4.91791644076479,173.7585255087246,,0,0,0,173.7585255087246,59.00828710752025,59.07013027742457,0.4399574754714055,0.88,1,59.07692872292708,35.643219544111446,36.198452653667154,0.4399574754714055,0.88,1,36.20913989046509,119.25649107080142,116.96543968630792,0.4399574754714055,0.88,1,117.63563483748474
15,ARG,8.960813368548118,9.247885299425505,0.4399574754714055,0.88,1,9.262716597247197,5.490087714457765,5.27,0.4008191243713717,0.6224489795918368,0,5.396416439965591,174.30236019770228,,0,0,0,174.30236019770228,52.3919669534521,52.446858159146466,0.4399574754714055,0.88,1,52.554064795199245,31.656916962876014,32.22,0.4008191243713717,0.6224489795918368,0,31.97356715142635,126.68032118389942,121.78,0.4399574754714055,0.88,1,122.7691267449051
16,PRO,,,0.0,0.0,0,,4.566917056210457,5.05,0.4008191243713717,0.6224489795918368,1,4.907953392790543,176.77269889539906,,0,0,0,176.77269889539906,63.30056562622932,62.762980398003094,0.4399574754714055,0.88,1,62.64868164585414,32.18904564353979,32.60760585040746,0.4399574754714055,0.88,1,32.642744431779334,,,0.0,0.0,0,
17,LYS,8.49697940001665,8.31,0.4399574754714055,0.88,1,8.406823425330225,4.509496510603285,,0.0,0.0,0,4.509496510603285,176.0891130863581,,0,0,0,176.0891130863581,55.14248167761683,56.74,0.4399574754714055,0.88,1,56.55079217913198,31.94533242597958,,0.0,0.0,0,31.94533242597958,123.76699394526028,123.41,0.4399574754714055,0.88,1,123.49553948799533
18,PRO,,,0.0,0.0,0,,4.270118938838939,4.17,0.4008191243713717,0.6224489795918368,1,4.217412954662004,178.71921477403154,,0,0,0,178.71921477403154,66.55292523529248,67.36809439074959,0.4399574754714055,0.88,1,67.33540714524365,31.925853355883007,32.585081423390356,0.4399574754714055,0.88,1,32.60651213947164,,,0.0,0.0,0,
19,LEU,8.745748791996892,8.780455970985988,0.4399574754714055,0.88,1,8.778657968242868,4.069563204828505,4.21,0.4008191243713717,0.6224489795918368,1,4.219197910755911,178.70911887590188,,0,0,0,178.70911887590188,57.45344067425353,58.1803908322737,0.4399574754714055,0.88,1,58.068169272255524,42.08299191526251,41.51,0.4008191243713717,0.6224489795918368,1,41.5985868499556,117.13756943682984,118.4429152592908,0.4399574754714055,0.88,1,118.43225004559329
20,LEU,7.8238929137862145,7.472394149592539,0.4399574754714055,0.88,1,7.529003122821623,3.93888186996337,4.067540711695178,0.4399574754714055,0.88,1,4.056814784265734,177.72888612911532,,0,0,0,177.72888612911532,57.27916508903874,56.88459288304822,0.4399574754714055,0.88,1,56.95858781483516,41.09473002029637,40.665309408883346,0.4399574754714055,0.88,1,40.76606356563992,120.89288374181373,118.79866465639817,0.4399574754714055,0.88,1,119.27532583352759
21,LEU,8.697401862920414,8.712101025387259,0.4399574754714055,0.88,1,8.77229023134088,3.830607056440782,3.82,0.4008191243713717,0.6224489795918368,1,3.8298508386779884,178.98742351851482,,0,0,0,178.98742351851482,58.03197970570541,58.20731272620218,0.4399574754714055,0.88,1,58.241332305827505,41.41705728108558,41.41239414959254,0.4399574754714055,0.88,1,41.46103090391275,120.66941772965367,120.15524427017107,0.4399574754714055,0.88,1,120.54142398686314
22,LYS,7.868022970285269,7.95,0.4399574754714055,0.88,1,7.9801751260073255,4.008159408030858,3.84,0.4399574754714055,0.88,1,3.8735786375790875,178.75751236272615,,0,0,0,178.75751236272615,59.72031976945832,59.69,0.4399574754714055,0.88,1,59.73494027602398,32.08451024000444,32.23,0.4399574754714055,0.88,1,32.263524754806305,118.93202351417472,118.33,0.4399574754714055,0.88,1,118.75771112442003
23,LEU,7.826660993456543,7.335016284678071,0.4399574754714055,0.88,1,7.3874870551781555,3.8543981649988903,3.95,0.4008191243713717,0.6224489795918368,1,3.96644444971695,179.9154981107004,,0,0,0,179.9154981107004,57.968291225746476,59.295993365362335,0.4399574754714055,0.88,1,59.12372410084915,41.83858981242646,40.93560253308863,0.4399574754714055,0.88,1,41.17015387011322,121.90538163612499,121.78565168903894,0.4399574754714055,0.88,1,122.00238439380064
24,LEU,8.678676512670663,8.14517913145878,0.4399574754714055,0.88,1,8.275036032545232,3.76085442430625,3.71,0.4008191243713717,0.6224489795918368,1,3.748562723032523,179.59322996233766,,0,0,0,179.59322996233766,57.96906775252525,57.91009770806843,0.4399574754714055,0.88,1,57.8368648496115,40.37212664342879,39.1323615802364,0.4399574754714055,0.88,1,39.445740715634365,118.95361437364858,119.97687273797817,0.4399574754714055,0.88,1,120.25656857272728
25,LYS,8.47091611089466,8.84501628467807,0.4399574754714055,0.88,1,8.868544538622487,4.383567744361194,4.39,0.4008191243713717,0.6224489795918368,1,4.395683911555111,180.87360008578088,,0,0,0,180.87360008578088,58.98285470400156,59.37485343789736,0.4399574754714055,0.88,1,59.34355988795649,32.07808410171495,31.95,0.4008191243713717,0.6224489795918368,1,32.159258101332,119.78973182488068,118.46452774433594,0.4399574754714055,0.88,1,118.95527641319237
26,SER,7.9604647934898445,7.929804583863148,0.4399574754714055,0.88,1,7.951751332234433,4.370263127811078,4.417540711695177,0.4399574754714055,0.88,1,4.433774518331668,175.727668807659,,0,0,0,175.727668807659,61.43229015966256,61.84258956572939,0.4399574754714055,0.88,1,61.79624601139416,63.1824768550172,62.94757328105132,0.4399574754714055,0.88,1,62.93104041724941,116.63535435971806,117.3134855249394,0.4399574754714055,0.88,1,117.73214292548563
27,VAL,7.292854073026972,7.29,0.4399574754714055,0.88,1,7.321513147197247,4.586663084448884,4.81,0.4399574754714055,0.88,1,4.816436280147629,175.59134286620602,,0,0,0,175.59134286620602,61.11757765436786,60.46,0.4399574754714055,0.88,1,60.54042810071595,31.27493231287046,30.76,0.4399574754714055,0.88,1,30.803599637873237,115.35953657099567,112.69,0.4399574754714055,0.88,1,113.02661867193918
28,GLY,7.86605931037851,7.617280156846041,0.4399574754714055,0.88,1,7.6691562023254525,4.08014902473915,,0.0,0.0,0,4.08014902473915,175.2299508995782,,0,0,0,175.2299508995782,45.665067188095236,45.39055367905442,0.4399574754714055,0.88,1,45.313475597030745,,,0.0,0.0,0,,107.57805393986014,106.26042340162985,0.4399574754714055,0.88,1,106.93641056108336
29,ALA,7.645427584065935,7.529511459657869,0.4399574754714055,0.88,1,7.5710554659895655,3.9766043644549898,4.062459288304822,0.4399574754714055,0.88,1,4.048788815306915,177.339905848668,,0,0,0,177.339905848668,53.04445499151959,53.20737786491447,0.4399574754714055,0.88,1,53.30153908118548,18.38210117066822,18.582035886674976,0.4399574754714055,0.88,1,18.536077435536686,124.17662844271284,124.70120506617725,0.4399574754714055,0.88,1,124.95207531984127
30,GLN,8.75237928924409,8.839804583863147,0.4399574754714055,0.88,1,8.850218458036409,4.526836431390832,4.594983715321929,0.4399574754714055,0.88,1,4.595970137268288,176.02899488086913,,0,0,0,176.02899488086913,55.986126731790435,55.520553679054416,0.4399574754714055,0.88,1,55.497050630724836,30.604494640664893,30.838126960105736,0.4399574754714055,0.88,1,30.840758382833833,119.73717704566545,118.800667973717,0.4399574754714055,0.88,1,119.14795732100121
31,LYS,8.07012085951271,7.310227985492994,0.4399574754714055,0.88,1,7.374938696692196,4.2743213598734595,4.657638419763604,0.4399574754714055,0.88,1,4.589960945077145,176.35957754112553,,0,0,0,176.35957754112553,55.71462487973138,61.27179071075562,0.4399574754714055,0.88,1,59.98627370134866,33.50784858850594,34.2,0.4008191243713717,0.6224489795918368,1,33.94289146169941,120.44262396250417,118.0133712302768,0.4399574754714055,0.88,1,118.62267000304696
32,ASP,8.487479354140303,8.37794571944192,0.4399574754714055,0.88,1,8.440581155128205,4.7391525648629145,4.63,0.4008191243713717,0.6224489795918368,0,4.692036467793318,175.66415890935176,,0,0,0,175.66415890935176,54.96167755792541,55.134924718621214,0.4399574754714055,0.88,1,55.180901724347876,41.55755980063825,42.59,0.4008191243713717,0.6224489795918368,0,42.21115741660007,119.69716396052837,120.9534161673447,0.4399574754714055,0.88,1,121.45740672518038
33,THR,7.177827707198358,6.957638419763604,0.4399574754714055,0.88,1,7.077607518503719,5.0929108794150295,4.955179131458781,0.4399574754714055,0.88,1,4.964418324492174,173.033406502331,,0,0,0,173.033406502331,61.09389700042735,60.49045597098599,0.4399574754714055,0.88,1,60.56600311140526,71.22881997727828,71.64285012057853,0.4399574754714055,0.88,1,71.67625146225441,114.18007544277388,111.01130277424568,0.4399574754714055,0.88,1,111.59607034087578
34,TYR,9.04940143955489,8.757160259228534,0.4399574754714055,0.88,1,8.862219984670883,5.006146984110334,4.82350436095202,0.4399574754714055,0.88,1,4.910138362237762,175.03478733823954,,0,0,0,175.03478733823954,57.36257329104229,57.26120840032828,0.4399574754714055,0.88,1,57.225493359024306,43.99063169425574,45.64078546021339,0.4399574754714055,0.88,1,45.54110094163059,122.66781185498945,120.12797641673359,0.4399574754714055,0.88,1,120.57273776640027
35,THR,9.118145805661007,9.01,0.4399574754714055,0.88,1,9.04931403042513,5.14404042086247,5.352654704441675,0.4399574754714055,0.88,1,5.407983930247529,176.46698606243754,,0,0,0,176.46698606243754,60.62090204141969,60.93032569356142,0.4399574754714055,0.88,1,60.9018900514097,71.03170846867022,70.95210102538725,0.4399574754714055,0.88,1,71.12481540099346,111.79861653730714,110.88193817860655,0.4399574754714055,0.88,1,111.46052258001997
36,MET,8.509310778094127,8.539088058028023,0.4399574754714055,0.88,1,8.56270361013431,4.2878297785381285,4.36,0.4008191243713717,0.6224489795918368,1,4.3529193677267175,178.33465335386836,,0,0,0,178.33465335386836,57.00616263981574,57.54970687579472,0.4399574754714055,0.88,1,57.50018667884338,30.642426290653788,30.527182448777616,0.4399574754714055,0.88,1,30.732941587179486,121.00146101829836,121.90229644152411,0.4399574754714055,0.88,1,122.20867922505272
37,LYS,8.324324104290154,8.59258956572939,0.4399574754714055,0.88,1,8.594878093833943,4.026507522477522,4.0299674306438575,0.4399574754714055,0.88,1,4.044724193062493,178.98317115215895,,0,0,0,178.98317115215895,59.70150662589078,59.79219873345569,0.4399574754714055,0.88,1,59.869207861760465,32.295948402281056,32.82223130281183,0.4399574754714055,0.88,1,32.83023928186258,119.7873428409868,117.77540711695178,0.4399574754714055,0.88,1,118.36450616869797
38,GLU,7.964302492979242,7.9375732810513195,0.4399574754714055,0.88,1,7.975850772205572,4.107501261943613,4.142459288304822,0.4399574754714055,0.88,1,4.156885443672993,178.82299096572316,,0,0,0,178.82299096572316,59.59542211008991,59.502491857660964,0.4399574754714055,0.88,1,59.53658606665002,30.639417216178266,31.76229644152411,0.4399574754714055,0.88,1,31.799648497891,119.9808354038295,120.33845265366715,0.4399574754714055,0.88,1,120.45717031828173
39,VAL,8.5402700997891,8.31,0.4399574754714055,0.88,1,8.426950632944832,3.4437411884504385,3.3175732810513194,0.4399574754714055,0.88,1,3.3796474598068604,177.52758628967143,,0,0,0,177.52758628967143,67.30692692089578,67.89055367905442,0.4399574754714055,0.88,1,67.79411148146853,31.31613338983794,30.70675904714777,0.4399574754714055,0.88,1,30.869816644488843,120.80916866739372,119.91718244877761,0.4399574754714055,0.88,1,120.45019801086136
40,LEU,8.274181522549673,8.280032569356141,0.4399574754714055,0.88,1,8.311979804378955,3.8846750823371075,3.9450814233903553,0.4399574754714055,0.88,1,3.954919442546343,178.6920389621323,,0,0,0,178.6920389621323,58.094676823243425,58.1472475874899,0.4399574754714055,0.88,1,58.11826999036519,41.17622006133866,41.108957780603454,0.4399574754714055,0.88,1,41.17464163767344,118.82684149665334,118.59618878149918,0.4399574754714055,0.88,1,119.04366333670218
41,PHE,8.210965717393718,8.063738674154216,0.4399574754714055,0.88,1,8.128785102763903,3.993068741361416,3.8977242852974343,0.4399574754714055,0.88,1,3.9125748525197017,177.6565969421745,,0,0,0,177.6565969421745,61.31883117574093,61.5009753063011,0.4399574754714055,0.88,1,61.48719744400045,39.12445314130869,38.379265409860444,0.4399574754714055,0.88,1,38.507762335092686,121.02565739115329,121.89733345974062,0.4399574754714055,0.88,1,122.12321252805528
42,TYR,8.47174406158841,8.609152125022392,0.4399574754714055,0.88,1,8.63491863963259,4.237069678013653,4.76,0.4008191243713717,0.6224489795918368,0,4.2819843423853925,178.75189064598734,,0,0,0,178.75189064598734,61.36965590107115,62.96002231249941,0.4399574754714055,0.88,1,62.84233710591075,37.823924009845705,38.82401624989392,0.4399574754714055,0.88,1,38.73291778131313,119.21974640950161,120.22859431253713,0.4399574754714055,0.88,1,120.3931796581252
43,LEU,8.725292808830059,8.810390832273704,0.4399574754714055,0.88,1,8.856513932828284,3.898975796725497,3.9825569963732486,0.4399574754714055,0.88,1,3.969268806837607,178.98670287148963,,0,0,0,178.98670287148963,58.04905537973138,58.17288268993467,0.4399574754714055,0.88,1,58.14436981082806,41.76309002227217,41.78,0.4399574754714055,0.88,1,41.76779822374292,121.35317208723498,121.10806182139345,0.4399574754714055,0.88,1,121.48185936486291
44,GLY,8.466155424741924,8.130390832273704,0.4399574754714055,0.88,1,8.247797513136863,3.834772228443779,,0.0,0.0,0,3.834772228443779,176.09776877318794,,0,0,0,176.09776877318794,47.420503972599626,47.283273522208376,0.4399574754714055,0.88,1,47.3060412463037,,,0.0,0.0,0,,107.3314112016095,106.35731272620218,0.4399574754714055,0.88,1,106.79428578979909
45,GLN,8.092228789072038,7.707638419763604,0.4399574754714055,0.88,1,7.841967255927407,3.964437524553224,3.76,0.4008191243713717,0.6224489795918368,1,3.748974224991675,178.38724972957598,,0,0,0,178.38724972957598,58.419611962842716,58.965635102444764,0.4399574754714055,0.88,1,58.87399205467311,28.357036546026194,28.577508142339035,0.4399574754714055,0.88,1,28.644137886002884,121.61313737081252,120.22674246055361,0.4399574754714055,0.88,1,120.8476603999778
46,TYR,8.224002651714951,8.702752412510101,0.4399574754714055,0.88,1,8.74345072059052,3.997438341347542,3.9324592883048224,0.4399574754714055,0.88,1,3.9502016447552446,177.11470830996782,,0,0,0,177.11470830996782,62.51323081428571,62.54835494559873,0.4399574754714055,0.88,1,62.55957839943945,38.822182718842264,38.3727524125101,0.4399574754714055,0.88,1,38.47011754332334,122.53337320868576,124.18845265366716,0.4399574754714055,0.88,1,124.38825112027972
47,ILE,8.46690248975469,8.307931543968882,0.4399574754714055,0.88,1,8.390245171289822,3.5749696072316572,3.33,0.4008191243713717,0.6224489795918368,1,3.429895776723277,177.87505340659342,,0,0,0,177.87505340659342,65.97513641395271,65.99281755122239,0.4399574754714055,0.88,1,66.11435253542568,38.33318302225552,38.78570024115705,0.4399574754714055,0.88,1,38.81295708918304,120.3069756481574,118.89478829918508,0.4399574754714055,0.88,1,119.36830265991232
48,MET,8.332879398901099,7.919934861287716,0.4399574754714055,0.88,1,8.03126673200688,4.392411253280053,4.377247587489899,0.4399574754714055,0.88,1,4.359705471767121,179.04184097918193,,0,0,0,179.04184097918193,57.72837788534798,57.85625392021147,0.4399574754714055,0.88,1,57.83853387943168,31.702625145732046,31.615863087937765,0.4399574754714055,0.88,1,31.610769789305138,118.30661097085691,115.78737786491448,0.4399574754714055,0.88,1,116.64417213514263
49,THR,8.118032547286047,8.6,0.4399574754714055,0.88,1,8.57493817004662,4.089590548945499,4.02,0.4399574754714055,0.88,1,4.019810188367188,176.40930061013984,,0,0,0,176.40930061013984,65.59290670690976,66.34,0.4399574754714055,0.88,1,66.42881885589411,68.88612122348762,69.05,0.4399574754714055,0.88,1,69.04885533872239,115.89871779123654,116.53,0.4399574754714055,0.88,1,116.80870390218669
50,LYS,7.987801193573093,5.0469384805226465,0.4399574754714055,0.88,1,6.907828753235653,4.218626079087579,4.12,0.4008191243713717,0.6224489795918368,1,4.1631769638084135,175.30293186043954,,0,0,0,175.30293186043954,55.721478635475634,55.49052110969827,0.4399574754714055,0.88,1,55.52586290588301,32.38414029321235,31.1966287697232,0.4399574754714055,0.88,1,31.275683629131986,119.06013196005661,114.68,0.4008191243713717,0.6224489795918368,1,116.95007618574759
51,ARG,7.736601446320346,7.630483360131313,0.4399574754714055,0.88,1,7.63663877963148,3.6053959314990562,3.8081873995075757,0.4399574754714055,0.88,1,3.782862577344877,176.2137300828949,,0,0,0,176.2137300828949,56.89704463066378,56.7912688203447,0.4399574754714055,0.88,1,56.754790238966585,26.911150040814746,26.59743166201894,0.4399574754714055,0.88,1,26.757851705189253,116.81920655484515,116.17489402132955,0.4399574754714055,0.88,1,116.47447007555778
52,LEU,7.9805807821456325,7.67741043427061,0.4399574754714055,0.88,1,7.74279916981907,4.2125362929348436,4.447475572982894,0.4399574754714055,0.88,1,4.42555695923521,176.6914906004107,,0,0,0,176.6914906004107,55.73351393527029,54.69026055484914,0.4399574754714055,0.88,1,54.94830096585082,42.0926398519314,42.00553739437635,0.4399574754714055,0.88,1,41.903020903912754,115.8608327123099,115.29495114596578,0.4399574754714055,0.88,1,115.48574061640582
53,TYR,6.835238212332111,6.860097708068426,0.4399574754714055,0.88,1,6.935728912037961,5.092059236618938,5.114918576609645,0.4399574754714055,0.88,1,5.126422047313798,176.10314061350317,,0,0,0,176.10314061350317,56.30253806889777,55.058159529461875,0.4399574754714055,0.88,1,55.240427046559,39.27831774474969,39.82,0.4008191243713717,0.6224489795918368,1,40.04876019694195,115.46256952738926,114.19819209881801,0.4399574754714055,0.88,1,114.7493963016539
54,ASP,8.84285204038739,8.632459288304823,0.4399574754714055,0.88,1,8.675203299395049,4.662690776226551,4.47,0.4008191243713717,0.6224489795918368,1,4.548951993073593,176.50734513003664,,0,0,0,176.50734513003664,54.438237869957824,54.209739445150866,0.4399574754714055,0.88,1,54.26518179248529,43.42102259937285,42.76763841976361,0.4399574754714055,0.88,1,42.75255749441115,123.33391983083028,123.21,0.4008191243713717,0.6224489795918368,1,123.47026653661894
55,GLU,8.740549957392608,8.667410434270609,0.4399574754714055,0.88,1,8.648915994733045,4.194355851159951,4.007443003626752,0.4399574754714055,0.88,1,4.03049045900211,177.6433334105783,,0,0,0,177.6433334105783,58.266238522938174,59.19465802176051,0.4399574754714055,0.88,1,59.18188999531024,29.917701713453212,30.147377864914468,0.4399574754714055,0.88,1,30.17789475813076,124.37537216389167,124.27013027742457,0.4399574754714055,0.88,1,124.69083502645134
56,LYS,8.491264012298812,8.282524427017107,0.4399574754714055,0.88,1,8.307360872172271,4.317381796608947,4.407443003626751,0.4399574754714055,0.88,1,4.40455952041847,176.75669527047953,,0,0,0,176.75669527047953,57.0859943990676,57.16239414959254,0.4399574754714055,0.88,1,57.1541146995782,33.18948703015873,33.64,0.4008191243713717,0.6224489795918368,1,33.573517338866694,117.50137352908204,116.66281755122239,0.4399574754714055,0.88,1,116.88924061633368
57,GLN,8.574096517010767,8.367508142339036,0.4399574754714055,0.88,1,8.39801851812632,4.548684354179154,4.65242671894868,0.4399574754714055,0.88,1,4.654284572116772,176.20709077624042,,0,0,0,176.20709077624042,55.000217892546345,54.17281755122239,0.4399574754714055,0.88,1,54.36484780678766,29.8316462496115,29.422198733455684,0.4399574754714055,0.88,1,29.639580853235653,120.03527297489732,121.01495114596578,0.4399574754714055,0.88,1,121.15647612420356